BDBM261602 US10513499, Compound 13::US11254644, Compound 13::US9708272, 13
SMILES OC(=O)c1cccc(CSc2nc(-c3ccccc3)c(Cl)c(=O)[nH]2)c1
InChI Key InChIKey=GEVZOEWVDMHSHC-UHFFFAOYSA-N
Data  4 IC50
  Tab Delimited (TSV)   2D SDfile   Computed 3D by Vconf -m prep SDfile
Find this compound or compounds like it in BindingDB:
Activity Spreadsheet -- Enzyme Inhibition Constant Data from BindingDB
Found 4 hits for monomerid = 261602
Target2-amino-3-carboxymuconate-6-semialdehyde decarboxylase(Homo sapiens (Human))
Tes Pharma
US Patent
LigandPNGBDBM261602(US10513499, Compound 13 | US11254644, Compound 13 ...)
Affinity DataIC50:  136nM. Assay description: The pre-assay mixture consisting of 3-hydroxyanthranilic acid (3OH-HA), 3-hydroxyanthranilic acid, 3,4-diOxygenase (HAO), and a dialyzed crude extrac...
Ligand InfoPC cidPC sid
In DepthDetails US Patent
Target2-amino-3-carboxymuconate-6-semialdehyde decarboxylase(Homo sapiens (Human))
Tes Pharma
US Patent
LigandPNGBDBM261602(US10513499, Compound 13 | US11254644, Compound 13 ...)
Affinity DataIC50:  136nM. Assay description: The activity of compounds 1-19 and 21-23 as inhibitors of ACMSD1 was determined by measuring the conversion of 3OH-Anthranilic Acid into product (i.e...
Ligand InfoPC cidPC sid
In DepthDetails US Patent
Target2-amino-3-carboxymuconate-6-semialdehyde decarboxylase(Homo sapiens (Human))
Tes Pharma
US Patent
LigandPNGBDBM261602(US10513499, Compound 13 | US11254644, Compound 13 ...)
Affinity DataIC50:  136nM. Assay description: The pre-assay mixture consisting of 3-hydroxyanthranilic acid (30H-HA), 3-hydroxyanthranilic acid, 3,4-diOxygenase (HAO), and a dialyzed crude extrac...
Ligand InfoPC cidPC sid
In DepthDetails US Patent
Target2-amino-3-carboxymuconate-6-semialdehyde decarboxylase(Homo sapiens (Human))
Tes Pharma
US Patent
LigandPNGBDBM261602(US10513499, Compound 13 | US11254644, Compound 13 ...)
Affinity DataIC50:  151nM. Assay description: Inhibition of human ACMSD expressed in Pichia pastoris using ACMS as substrate by coupled spectrophotometric assay
Ligand InfoPC cidPC sid
In DepthDetails ArticlePubMed