BDBM263991 2-{5-[(4-ethylbenzyl)oxy]- 1H-pyrazol-1-yl}pyridine- 4-carboxylic acid::US10173996, Example 56::US9604961, Example 56::US9714230, 56::US9908865, Example 56
SMILES CCc1ccc(COc2ccnn2-c2cc(ccn2)C(O)=O)cc1
InChI Key InChIKey=MKBWAOCGFREQKS-UHFFFAOYSA-N
Data  7 IC50  1 EC50
  Tab Delimited (TSV)   2D SDfile   Computed 3D by Vconf -m prep SDfile
Find this compound or compounds like it in BindingDB:
Activity Spreadsheet -- Enzyme Inhibition Constant Data from BindingDB
Found 8 hits for monomerid = 263991
TargetLysine-specific demethylase 5A(Homo sapiens (Human))
Celgene Quanticel Research
US Patent
LigandPNGBDBM263991(2-{5-[(4-ethylbenzyl)oxy]- 1H-pyrazol-1-yl}pyridin...)
Affinity DataIC50: <100nM. Assay description: The enzymatic assay of Jarid1A activity is based upon Time Resolved-Fluorescence Resonance Energy Transfer (TR-FRET) detection. The ability of test c...
Ligand InfoPC cidPC sid
In DepthDetails US Patent
TargetLysine-specific demethylase 5B(Homo sapiens (Human))
Celgene Quanticel Research
US Patent
LigandPNGBDBM263991(2-{5-[(4-ethylbenzyl)oxy]- 1H-pyrazol-1-yl}pyridin...)
Affinity DataIC50: <100nM. Assay description: The ability of test compounds to inhibit the activity of Jarid1B was determined in 384-well plate format under the following reaction conditions: 0.8...
Ligand InfoPC cidPC sid
In DepthDetails US Patent
TargetLysine-specific demethylase 4C(Homo sapiens (Human))
Celgene Quanticel Research
US Patent
LigandPNGBDBM263991(2-{5-[(4-ethylbenzyl)oxy]- 1H-pyrazol-1-yl}pyridin...)
Affinity DataIC50:  550nM. Assay description: The ability of test compounds to inhibit the activity of JMJD2C was determined in 384-well plate format under the following reaction conditions: 0.3 ...
Ligand InfoPC cidPC sid
In DepthDetails US Patent
TargetLysine-specific demethylase 5A(Homo sapiens (Human))
Celgene Quanticel Research
US Patent
LigandPNGBDBM263991(2-{5-[(4-ethylbenzyl)oxy]- 1H-pyrazol-1-yl}pyridin...)
Affinity DataIC50:  44nM. Assay description: Inhibition of KDM5A (unknown origin) preincubated with enzyme
Ligand InfoPC cidPC sid
In DepthDetails ArticlePubMed
TargetLysine-specific demethylase 4C(Homo sapiens (Human))
Celgene Quanticel Research
US Patent
LigandPNGBDBM263991(2-{5-[(4-ethylbenzyl)oxy]- 1H-pyrazol-1-yl}pyridin...)
Affinity DataIC50:  3.60E+3nM. Assay description: Inhibition of KDM4C (unknown origin) preincubated with enzyme
Ligand InfoPC cidPC sid
In DepthDetails ArticlePubMed
TargetLysine-specific demethylase 5A/5B(Homo sapiens (Human))
Celgene
Curated by ChEMBL
LigandPNGBDBM263991(2-{5-[(4-ethylbenzyl)oxy]- 1H-pyrazol-1-yl}pyridin...)
Affinity DataEC50:  1.30E+3nM. Assay description: Inhibition of KDM5A/KDM5B in human ZR-75-1 cells assessed as increase in H3K4me3 level after 72 hrs by fluorometric immunoassay
Ligand InfoPC cidPC sid
In DepthDetails ArticlePubMed
TargetLysine-specific demethylase 5B(Homo sapiens (Human))
Celgene Quanticel Research
US Patent
LigandPNGBDBM263991(2-{5-[(4-ethylbenzyl)oxy]- 1H-pyrazol-1-yl}pyridin...)
Affinity DataIC50:  3nM. Assay description: Inhibition of KDM5B (unknown origin) preincubated with enzyme
Ligand InfoPC cidPC sid
In DepthDetails ArticlePubMed
TargetLysine-specific demethylase 2B(Homo sapiens (Human))
Celgene Quanticel Research
US Patent
LigandPNGBDBM263991(2-{5-[(4-ethylbenzyl)oxy]- 1H-pyrazol-1-yl}pyridin...)
Affinity DataIC50:  5.50E+3nM. Assay description: The ability of test compounds to inhibit the activity of FBXL10 was determined in 384-well plate format under the following reaction conditions: 0.3 ...
Ligand InfoPC cidPC sid
In DepthDetails US Patent