BDBM264770 US9718792, 24
SMILES C\C=C\c1ccc(cc1)C1=NO[C@@H](C[C@](C)(C(=O)NO)S(C)(=O)=O)C1
InChI Key InChIKey=BWZIXURSISHNIJ-XUOJHOASSA-N
Data  1 IC50  1 Kd
  Tab Delimited (TSV)   2D SDfile   Computed 3D by Vconf -m prep SDfile
Find this compound or compounds like it in BindingDB:
Activity Spreadsheet -- Enzyme Inhibition Constant Data from BindingDB
Found 2 hits for monomerid = 264770
TargetUDP-3-O-acyl-N-acetylglucosamine deacetylase(Pseudomonas aeruginosa)
Novartis Institutes For Biomedical Research
Curated by ChEMBL
LigandPNGBDBM264770(US9718792, 24)
Affinity DataKd:  0.300nM. Assay description: Binding affinity to Pseudomonas aeruginosa PAO1 NB52019 LpxC after 60 to 420 secs by SPR method
Ligand InfoPC cidPC sid
In DepthDetails ArticlePubMed
TargetUDP-3-O-acyl-N-acetylglucosamine deacetylase(Pseudomonas aeruginosa)
Novartis Institutes For Biomedical Research
Curated by ChEMBL
LigandPNGBDBM264770(US9718792, 24)
Affinity DataIC50:  0.00100nMpH: 7.5 T: 2°C. Assay description: The P. aeruginosa LpxC protein is produced according to the general method of Hyland et al (Journal of Bacteriology 1997 179, 2029-2037: Cloning, exp...
Ligand InfoPC cidPC sid
In DepthDetails US Patent