BDBM275734 US10071086, Compound 602
SMILES CCCC(=O)Nc1cncc(c1)-c1cnc2[nH]nc(-c3nc4c(cccc4[nH]3)-c3ccccc3F)c2c1
InChI Key InChIKey=DTBSJPOYHJVTAW-UHFFFAOYSA-N
Data  1 IC50
  Tab Delimited (TSV)   2D SDfile   Computed 3D by Vconf -m prep SDfile
Find this compound or compounds like it in BindingDB:
Activity Spreadsheet -- Enzyme Inhibition Constant Data from BindingDB
Found 1 hit for monomerid = 275734
TargetAdenomatous polyposis coli protein(Homo sapiens (Human))
Samumed
US Patent
LigandPNGBDBM275734(US10071086, Compound 602)
Affinity DataIC50:  18nM. Assay description: Reporter cell lines can be generated by stably transducing cells of cancer cell lines (e.g., colon cancer) with a lentiviral construct that include a...
Ligand InfoPC cidPC sid
In DepthDetails US Patent