BDBM278511 (S)-2'-(2,6-difluoro-3,5-dimethoxyphenyl)-6'-(2-hydroxypropylamino)-1'H-spiro[cyclopropane-1,4'-[2,7]naphthyridin]-3'(2'H)-one::US10040790, Example 27::US10450313, Example 27::US10947230, Example 27::US11530214, Example 27
SMILES COc1cc(OC)c(F)c(N2Cc3cnc(NC[C@H](C)O)cc3C3(CC3)C2=O)c1F
InChI Key InChIKey=VPBADHFSKMXWLX-NSHDSACASA-N
Data  12 IC50
  Tab Delimited (TSV)   2D SDfile   Computed 3D by Vconf -m prep SDfile
Find this compound or compounds like it in BindingDB:
Activity Spreadsheet -- Enzyme Inhibition Constant Data from BindingDB
Found 12 hits for monomerid = 278511
TargetFibroblast growth factor receptor 1(Homo sapiens (Human))
Incyte Holdings
US Patent
LigandPNGBDBM278511((S)-2'-(2,6-difluoro-3,5-dimethoxyphenyl)-6'-(2-hy...)
Affinity DataIC50: <100nMpH: 7.5Assay Description:The inhibitor potency of the exemplified compounds was measured in an enzyme assay that measures peptide phosphorylation using FRET measurements to d...
Ligand InfoPC cidPC sid
In DepthDetails US Patent
TargetFibroblast growth factor receptor 2(Homo sapiens (Human))
Incyte Holdings
US Patent
LigandPNGBDBM278511((S)-2'-(2,6-difluoro-3,5-dimethoxyphenyl)-6'-(2-hy...)
Affinity DataIC50: <100nM
Ligand InfoPC cidPC sid
In DepthDetails US Patent
TargetFibroblast growth factor receptor 3(Homo sapiens (Human))
Incyte Holdings
US Patent
LigandPNGBDBM278511((S)-2'-(2,6-difluoro-3,5-dimethoxyphenyl)-6'-(2-hy...)
Affinity DataIC50: <100nM
Ligand InfoPC cidPC sid
In DepthDetails US Patent
TargetFibroblast growth factor receptor 1(Homo sapiens (Human))
Incyte Holdings
US Patent
LigandPNGBDBM278511((S)-2'-(2,6-difluoro-3,5-dimethoxyphenyl)-6'-(2-hy...)
Affinity DataIC50: <100nM. Assay description: The inhibitor potency of the exemplified compounds was measured in an enzyme assay that measures peptide phosphorylation using FRET measurements to d...
Ligand InfoPC cidPC sid
In DepthDetails US Patent
TargetFibroblast growth factor receptor 2(Homo sapiens (Human))
Incyte Holdings
US Patent
LigandPNGBDBM278511((S)-2'-(2,6-difluoro-3,5-dimethoxyphenyl)-6'-(2-hy...)
Affinity DataIC50: <100nM. Assay description: The inhibitor potency of the exemplified compounds was measured in an enzyme assay that measures peptide phosphorylation using FRET measurements to d...
Ligand InfoPC cidPC sid
In DepthDetails US Patent
TargetFibroblast growth factor receptor 3(Homo sapiens (Human))
Incyte Holdings
US Patent
LigandPNGBDBM278511((S)-2'-(2,6-difluoro-3,5-dimethoxyphenyl)-6'-(2-hy...)
Affinity DataIC50: <100nM. Assay description: The inhibitor potency of the exemplified compounds was measured in an enzyme assay that measures peptide phosphorylation using FRET measurements to d...
Ligand InfoPC cidPC sid
In DepthDetails US Patent
TargetFibroblast growth factor receptor 1(Homo sapiens (Human))
Incyte Holdings
US Patent
LigandPNGBDBM278511((S)-2'-(2,6-difluoro-3,5-dimethoxyphenyl)-6'-(2-hy...)
Affinity DataIC50: <100nM. Assay description: The inhibitor potency of the exemplified compounds was measured in an enzyme assay that measures peptide phosphorylation using FRET measurements to d...
Ligand InfoPC cidPC sid
In DepthDetails US Patent
TargetFibroblast growth factor receptor 2(Homo sapiens (Human))
Incyte Holdings
US Patent
LigandPNGBDBM278511((S)-2'-(2,6-difluoro-3,5-dimethoxyphenyl)-6'-(2-hy...)
Affinity DataIC50: <100nM. Assay description: The inhibitor potency of the exemplified compounds was measured in an enzyme assay that measures peptide phosphorylation using FRET measurements to d...
Ligand InfoPC cidPC sid
In DepthDetails US Patent
TargetFibroblast growth factor receptor 3(Homo sapiens (Human))
Incyte Holdings
US Patent
LigandPNGBDBM278511((S)-2'-(2,6-difluoro-3,5-dimethoxyphenyl)-6'-(2-hy...)
Affinity DataIC50: <100nM. Assay description: The inhibitor potency of the exemplified compounds was measured in an enzyme assay that measures peptide phosphorylation using FRET measurements to d...
Ligand InfoPC cidPC sid
In DepthDetails US Patent
TargetFibroblast growth factor receptor 1(Homo sapiens (Human))
Incyte Holdings
US Patent
LigandPNGBDBM278511((S)-2'-(2,6-difluoro-3,5-dimethoxyphenyl)-6'-(2-hy...)
Affinity DataIC50: <100nM. Assay description: The inhibitor potency of the exemplified compounds was measured in an enzyme assay that measures peptide phosphorylation using FRET measurements to d...
Ligand InfoPC cidPC sid
In DepthDetails US Patent
TargetFibroblast growth factor receptor 2(Homo sapiens (Human))
Incyte Holdings
US Patent
LigandPNGBDBM278511((S)-2'-(2,6-difluoro-3,5-dimethoxyphenyl)-6'-(2-hy...)
Affinity DataIC50: <100nM. Assay description: The inhibitor potency of the exemplified compounds was measured in an enzyme assay that measures peptide phosphorylation using FRET measurements to d...
Ligand InfoPC cidPC sid
In DepthDetails US Patent
TargetFibroblast growth factor receptor 3(Homo sapiens (Human))
Incyte Holdings
US Patent
LigandPNGBDBM278511((S)-2'-(2,6-difluoro-3,5-dimethoxyphenyl)-6'-(2-hy...)
Affinity DataIC50: <100nM. Assay description: The inhibitor potency of the exemplified compounds was measured in an enzyme assay that measures peptide phosphorylation using FRET measurements to d...
Ligand InfoPC cidPC sid
In DepthDetails US Patent