BDBM280637 US10030020, Example 182::US10781211, Example 182
SMILES OC(=O)c1ccc(CN2CCCC22CCN(CC2)C(=O)OC(C(F)(F)F)C(F)(F)F)cc1C(F)(F)F
InChI Key InChIKey=ILGCMFDCSWOUDR-UHFFFAOYSA-N
Data  8 IC50
  Tab Delimited (TSV)   2D SDfile   Computed 3D by Vconf -m prep SDfile
Find this compound or compounds like it in BindingDB:
Activity Spreadsheet -- Enzyme Inhibition Constant Data from BindingDB
Found 8 hits for monomerid = 280637
TargetMonoglyceride lipase(Mus musculus (mouse))
Abide Therapeutics
US Patent
LigandPNGBDBM280637(US10030020, Example 182 | US10781211, Example 182)
Affinity DataIC50: <100nM. Assay description: Proteomes (mouse brain membrane fraction or cell lysates) (50 μL, 1.0 mg/mL total protein concentration) were preincubated with varying concentr...
Ligand InfoPC cidPC sid
In DepthDetails US Patent
TargetFatty-acid amide hydrolase 1(Mus musculus (mouse))
Abide Therapeutics
US Patent
LigandPNGBDBM280637(US10030020, Example 182 | US10781211, Example 182)
Affinity DataIC50: >1.00E+3nM. Assay description: Proteomes (mouse brain membrane fraction or cell lysates) (50 μL, 1.0 mg/mL total protein concentration) were preincubated with varying concentr...
Ligand InfoPC cidPC sid
In DepthDetails US Patent
TargetMonoacylglycerol lipase ABHD2(Mus musculus (Mouse))
Abide Therapeutics
US Patent
LigandPNGBDBM280637(US10030020, Example 182 | US10781211, Example 182)
Affinity DataIC50: >1.00E+3nM. Assay description: Proteomes (mouse brain membrane fraction or cell lysates) (50 μL, 1.0 mg/mL total protein concentration) were preincubated with varying concentr...
Ligand InfoPC cidPC sid
In DepthDetails US Patent
TargetMonoglyceride lipase(Homo sapiens (Human))
Lundbeck La Jolla Research Center
US Patent
LigandPNGBDBM280637(US10030020, Example 182 | US10781211, Example 182)
Affinity DataIC50:  550nM. Assay description: Human: Proteomes (human prefrontal cortex or cell membrane fractions) (50 μL, 1.0-2.0 mg/mL total protein concentration) were preincubated with ...
Ligand InfoPC cidPC sid
In DepthDetails US Patent
TargetMonoglyceride lipase(Mus musculus (mouse))
Abide Therapeutics
US Patent
LigandPNGBDBM280637(US10030020, Example 182 | US10781211, Example 182)
Affinity DataIC50: <100nM. Assay description: MAGL, ABHD6 and FAAH: Proteomes (mouse brain membrane fraction or cell lysates) (50 μL, 1.0 mg/mL total protein concentration) were preincubated...
Ligand InfoPC cidPC sid
In DepthDetails US Patent
TargetFatty-acid amide hydrolase 1(Mus musculus (mouse))
Abide Therapeutics
US Patent
LigandPNGBDBM280637(US10030020, Example 182 | US10781211, Example 182)
Affinity DataIC50: >1.00E+3nM. Assay description: MAGL, ABHD6 and FAAH: Proteomes (mouse brain membrane fraction or cell lysates) (50 μL, 1.0 mg/mL total protein concentration) were preincubated...
Ligand InfoPC cidPC sid
In DepthDetails US Patent
TargetMonoacylglycerol lipase ABHD6(Mus musculus (mouse))
Lundbeck La Jolla Research Center
US Patent
LigandPNGBDBM280637(US10030020, Example 182 | US10781211, Example 182)
Affinity DataIC50: >1.00E+3nM. Assay description: MAGL, ABHD6 and FAAH: Proteomes (mouse brain membrane fraction or cell lysates) (50 μL, 1.0 mg/mL total protein concentration) were preincubated...
Ligand InfoPC cidPC sid
In DepthDetails US Patent
TargetMonoglyceride lipase(Homo sapiens (Human))
Lundbeck La Jolla Research Center
US Patent
LigandPNGBDBM280637(US10030020, Example 182 | US10781211, Example 182)
Affinity DataIC50:  550nMT: 2°C. Assay description: Proteomes (human prefrontal cortex or cell membrane fractions) (50 μL, 1.0-2.0 mg/mL total protein concentration) were preincubated with varying...
Ligand InfoPC cidPC sid
In DepthDetails US Patent