BDBM281022 (12S,15S,18S)-15-(4-Amino-butyl)-23-(4-aminomethyl-phenyl)-18-(3-amino-propyl)-4-chloro-12-(1H-indol-3-ylmethyl)-13-methyl-2-thia-10,13,16,19-tetraaza-tricyclo[19.4.0.0*3,8*]pentacosa-1(25),3,5,7,21,23-hexaene-11,14,17-trione::US10030047, Example 216
SMILES CN1[C@@H](Cc2c[nH]c3ccccc23)C(=O)NCc2cccc(Cl)c2Sc2ccc(cc2CN[C@@H](CCCN)C(=O)N[C@@H](CCCCN)C1=O)-c1ccc(CN)cc1
InChI Key
Data  1 IC50
  Tab Delimited (TSV)   2D SDfile   Computed 3D by Vconf -m prep SDfile
Find this compound or compounds like it in BindingDB:
Activity Spreadsheet -- Enzyme Inhibition Constant Data from BindingDB
Found 1 hit for monomerid = 281022
TargetAdhesin Ata autotransporter(Acinetobacter baumannii (strain ATCC 17978 / CIP 5...)
Hoffmann-La Roche
US Patent
LigandPNGBDBM281022((12S,15S,18S)-15-(4-Amino-butyl)-23-(4-aminomethyl...)
Affinity DataIC50:  700nM. Assay description: The in vitro antimicrobial activity of the compounds was alternatively determined according to the following procedure:The assay used a 10-points Iso...
Ligand InfoPC cidPC sid
In DepthDetails US Patent