BDBM281912 N-cyclopropyl-3-[3-{[(3-{[(1S)- 1-phenylethyl]carbamoyl} pyridin-2-yl)amino]methyl}- 5-(propan-2-yloxy)phenyl]- 1H-pyrrolo[2,3-b] pyridine-5-carboxamide::US10030016, Example 4.1.13
SMILES CC(C)Oc1cc(CNc2ncccc2C(=O)N[C@@H](C)c2ccccc2)cc(c1)-c1c[nH]c2ncc(cc12)C(=O)NC1CC1
InChI Key
Data  1 IC50
  Tab Delimited (TSV)   2D SDfile   Computed 3D by Vconf -m prep SDfile
Find this compound or compounds like it in BindingDB:
Activity Spreadsheet -- Enzyme Inhibition Constant Data from BindingDB
Found 1 hit for monomerid = 281912
Target3-phosphoinositide-dependent protein kinase 1 [51-359](Homo sapiens (Human))
Sunesis Pharmaceuticals
US Patent
LigandPNGBDBM281912(N-cyclopropyl-3-[3-{[(3-{[(1S)- 1-phenylethyl]carb...)
Affinity DataIC50: <100nM. Assay description: PDK1 (amino acids 51-359) and AKT2 (amino acids 140-467 fused to PIFtide, amino acids EEQEMFRDFDYIADW) were expressed as N-terminally tagged GST fusi...
Ligand InfoPC cidPC sid
In DepthDetails US Patent