BDBM282581 4-Bromo-5-(3-chloro-5-fluorophenoxy)-2,2-difluoro- 3-hydroxy-2,3-dihydrobenzo[b]thiophene 1,1-dioxide::US9884843, Compound 9
SMILES OC1c2c(ccc(Oc3cc(F)cc(Cl)c3)c2Br)S(=O)(=O)C1(F)F
InChI Key InChIKey=QDJHBOPWDGYCGJ-UHFFFAOYSA-N
Data  2 IC50  2 EC50
  Tab Delimited (TSV)   2D SDfile   Computed 3D by Vconf -m prep SDfile
Find this compound or compounds like it in BindingDB:
Activity Spreadsheet -- Enzyme Inhibition Constant Data from BindingDB
Found 4 hits for monomerid = 282581
TargetVascular endothelial growth factor A(Homo sapiens (Human))
Peloton Therapeutics
US Patent
LigandPNGBDBM282581(4-Bromo-5-(3-chloro-5-fluorophenoxy)-2,2-difluoro-...)
Affinity DataIC50:  2nMpH: 7.5Assay Description:The total assay volume was about 100 μL in the following configuration: 2-μL compound in DMSO, 88 μL buffer with protein and probe and...
Ligand InfoPC cidPC sid
In DepthDetails US Patent
TargetEndothelial PAS domain-containing protein 1(Homo sapiens (Human))
Peloton Therapeutics
Curated by ChEMBL
LigandPNGBDBM282581(4-Bromo-5-(3-chloro-5-fluorophenoxy)-2,2-difluoro-...)
Affinity DataEC50:  43nM. Assay description: Antagonist activity at HIF-2alpha in human 786-O cells co-expressing HIF responsive element after 24 hrs by ONE-Glo luciferase reporter gene assay
Ligand InfoPC cidPC sid
In DepthDetails ArticlePubMed
TargetEndothelial PAS domain-containing protein 1(Homo sapiens (Human))
Peloton Therapeutics
Curated by ChEMBL
LigandPNGBDBM282581(4-Bromo-5-(3-chloro-5-fluorophenoxy)-2,2-difluoro-...)
Affinity DataIC50: <5nM. Assay description: Binding affinity to His-tagged HIF-2alpha PAS-B domain (unknown origin) after 2 hrs by scintillation proximity assay
Ligand InfoPC cidPC sid
In DepthDetails ArticlePubMed
TargetVascular endothelial growth factor A(Homo sapiens (Human))
Peloton Therapeutics
US Patent
LigandPNGBDBM282581(4-Bromo-5-(3-chloro-5-fluorophenoxy)-2,2-difluoro-...)
Affinity DataEC50:  65nM. Assay description: About 7500 of 786-O cells in 180 μL of growth medium were seeded into each well of a 96 well plate with white clear bottom on the first day (07-...
Ligand InfoPC cidPC sid
In DepthDetails US Patent