BDBM28319 (1R,2S)-1-{[4-(4-acetamidophenyl)benzene][2-(2-oxopyrrolidin-1-yl)ethyl]sulfonamido}-2-phenylcyclopropane-1-carboxylic acid::sulfonylamino-alkanecarboxylate, 18
SMILES CC(=O)Nc1ccc(cc1)-c1ccc(cc1)S(=O)(=O)N(CCN1CCCC1=O)[C@@]1(C[C@H]1c1ccccc1)C(O)=O
InChI Key InChIKey=NDQXMENKCZYNJS-BHBYDHKZSA-N
Data  1 IC50
  Tab Delimited (TSV)   2D SDfile   Computed 3D by Vconf -m prep SDfile
Find this compound or compounds like it in BindingDB:
Activity Spreadsheet -- Enzyme Inhibition Constant Data from BindingDB
Found 1 hit for monomerid = 28319
LigandPNGBDBM28319((1R,2S)-1-{[4-(4-acetamidophenyl)benzene][2-(2-oxo...)
Affinity DataIC50:  4.50E+3nMpH: 7.5 T: 2°C. Assay description: The ADAMTS-5 (Aggrecanase-2) assay was performed using fluorescent peptide substrate WAAG-3R and the recombinant Agg-2 pre-incubated with various con...
In DepthDetails ArticlePubMed