BDBM28518 (3R,5S)-5-{2-[4-({3-chloro-4-[(3-fluorophenyl)methoxy]phenyl}amino)thieno[3,2-d]pyrimidin-6-yl]ethynyl}pyrrolidin-3-yl piperazine-1-carboxylate::pyrrolidinyl-acetylenic thieno[3,2-d]pyrimidine, 6i
SMILES Fc1cccc(COc2ccc(Nc3ncnc4cc(sc34)C#C[C@@H]3C[C@H](CN3)OC(=O)N3CCNCC3)cc2Cl)c1
InChI Key InChIKey=QHVIPDJZOQGJIA-FYYLOGMGSA-N
Data  2 IC50
  Tab Delimited (TSV)   2D SDfile   Computed 3D by Vconf -m prep SDfile
Find this compound or compounds like it in BindingDB:
Activity Spreadsheet -- Enzyme Inhibition Constant Data from BindingDB
Found 2 hits for monomerid = 28518
TargetReceptor tyrosine-protein kinase erbB-2(Homo sapiens (Human))
Gsk
LigandPNGBDBM28518((3R,5S)-5-{2-[4-({3-chloro-4-[(3-fluorophenyl)meth...)
Affinity DataIC50:  20nM. Assay description: Assays were performed in 96-well polystyrene round-bottomed plates in reaction buffer containing biotinylated substrate and purified kinase in the pr...
In DepthDetails ArticlePubMed
TargetEpidermal growth factor receptor(Homo sapiens (Human))
Gsk
LigandPNGBDBM28518((3R,5S)-5-{2-[4-({3-chloro-4-[(3-fluorophenyl)meth...)
Affinity DataIC50:  63nMpH: 7.5 T: 2°C. Assay description: Assays were performed in 96-well polystyrene round-bottomed plates in reaction buffer containing biotinylated substrate and purified kinase in the pr...
In DepthDetails ArticlePubMed