BDBM28906 2-mercaptoacetamide, 12a::N-[3-(4-chlorophenyl)-1H-pyrazol-5-yl]-2-sulfanylacetamide
SMILES SCC(=O)Nc1cc(n[nH]1)-c1ccc(Cl)cc1
InChI Key InChIKey=JALQHWDJULITDF-UHFFFAOYSA-N
Data  1 IC50
PDB links: 1 PDB ID matches this monomer.
  Tab Delimited (TSV)   2D SDfile   Computed 3D by Vconf -m prep SDfile
Find this compound or compounds like it in BindingDB:
Activity Spreadsheet -- Enzyme Inhibition Constant Data from BindingDB
Found 1 hit for monomerid = 28906
TargetBotulinum neurotoxin type A2 [1-425](Clostridium botulinum)
Absolute Science
LigandPNGBDBM28906(2-mercaptoacetamide, 12a | N-[3-(4-chlorophenyl)-1...)
Affinity DataIC50:  4.80E+3nMpH: 7.4 T: 2°C. Assay description: Reactions between recombinant BoNTA-LC and fluorescent peptide substrate were carried out in 96-well microplates. Reaction progress was measured cont...