BDBM28908 N-[3-(4-chlorophenyl)-1H-pyrazol-5-yl]acetamide::N-[5-(4-chlorophenyl)-1H-pyrazol-3-yl]acetamide::acetamide, 7
SMILES CC(=O)Nc1cc(n[nH]1)-c1ccc(Cl)cc1
InChI Key InChIKey=IIKSZRFVYVTNHL-UHFFFAOYSA-N
Data  3 EC50  1 Other
  Tab Delimited (TSV)   2D SDfile   Computed 3D by Vconf -m prep SDfile
Find this compound or compounds like it in BindingDB:
Activity Spreadsheet -- Enzyme Inhibition Constant Data from BindingDB
Found 4 hits for monomerid = 28908
TargetBotulinum neurotoxin type A2 [1-425](Clostridium botulinum)
Absolute Science
LigandPNGBDBM28908(N-[3-(4-chlorophenyl)-1H-pyrazol-5-yl]acetamide | ...)
Affinity DatapH: 7.4 T: 2°C. Assay description: Reactions between recombinant BoNTA-LC and fluorescent peptide substrate were carried out in 96-well microplates. Reaction progress was measured cont...
In DepthDetails ArticlePubMed
TargetAryl hydrocarbon receptor(Homo sapiens (Human))
The Scripps Research Institute Molecular Screening Center
Curated by PubChem BioAssay
LigandPNGBDBM28908(N-[3-(4-chlorophenyl)-1H-pyrazol-5-yl]acetamide | ...)
Affinity DataEC50:  1.80E+3nM. Assay description: Source (MLPCN Center Name): The Scripps Research Institute Molecular Screening Center (SRIMSC) Center Affiliation: The Scripps Research Institute (TS...
In DepthDetails PCBioAssay
TargetNuclear receptor subfamily 1 group I member 2(Homo sapiens (Human))
The Scripps Research Institute Molecular Screening Center
Curated by PubChem BioAssay
LigandPNGBDBM28908(N-[3-(4-chlorophenyl)-1H-pyrazol-5-yl]acetamide | ...)
Affinity DataEC50:  7.47E+4nM. Assay description: Source (MLPCN Center Name): The Scripps Research Institute Molecular Screening Center (SRIMSC) Center Affiliation: The Scripps Research Institute (TS...
In DepthDetails PCBioAssay
TargetGlycogen synthase kinase-3 beta(Homo sapiens (Human))
Broad Institute
Curated by PubChem BioAssay
LigandPNGBDBM28908(N-[3-(4-chlorophenyl)-1H-pyrazol-5-yl]acetamide | ...)
Affinity DataEC50:  2.38E+4nM. Assay description: Keywords: GSK3beta, dose response, kinase, inhibition, HTS Assay Overview: The glycogen synthase kinase-3 beta (GSK-3b) is a known master regulator f...
In DepthDetails PCBioAssay