BDBM289755 US10093671, Example 24
SMILES COc1cc-2c(CC(c3cccs3)n3cc(C(O)=O)c(=O)cc-23)cc1OCCCCCCNS(C)(=O)=O
InChI Key InChIKey=VQSWSJPAJMFVCT-UHFFFAOYSA-N
Data  1 IC50
  Tab Delimited (TSV)   2D SDfile   Computed 3D by Vconf -m prep SDfile
Find this compound or compounds like it in BindingDB:
Activity Spreadsheet -- Enzyme Inhibition Constant Data from BindingDB
Found 1 hit for monomerid = 289755
TargetLarge envelope protein(Hepatitis B virus)
Hoffmann-La Roche
US Patent
LigandPNGBDBM289755(US10093671, Example 24)
Affinity DataIC50:  10nMT: 2°C. Assay description: HepG2.2.15 cells were seeded in duplicate into white, 96-well plates at 1.5×104 cells/well. The cells were treated with a three-fold serial dilution ...
Ligand InfoPC cidPC sid
In DepthDetails US Patent