BDBM29095 dibenzothiazepine, 12a
SMILES O=C(NN1CCCCC1)c1ccc2Sc3ccccc3C(=Nc2c1)C1CCCCC1
InChI Key InChIKey=QPUXUSUONDVIKY-UHFFFAOYSA-N
Data  1 KI  1 Other
  Tab Delimited (TSV)   2D SDfile   Computed 3D by Vconf -m prep SDfile
Find this compound or compounds like it in BindingDB:
Activity Spreadsheet -- Enzyme Inhibition Constant Data from BindingDB
Found 2 hits for monomerid = 29095
TargetCannabinoid receptor 1(Homo sapiens (Human))
Acadia Pharmaceuticals
LigandPNGBDBM29095(dibenzothiazepine, 12a)
Affinity DataKi:  3nM ΔG°:  -11.5kcal/molepH: 7.2 T: 2°C. Assay description: IC50 values for test compounds were determined from nonlinear regression analysis of data collected from ligand displacement experiments. The inhibit...
In DepthDetails ArticlePubMed
TargetCannabinoid receptor 2(Homo sapiens (Human))
Acadia Pharmaceuticals
LigandPNGBDBM29095(dibenzothiazepine, 12a)
Affinity DatapH: 7.2 T: 2°C. Assay description: IC50 values for test compounds were determined from nonlinear regression analysis of data collected from ligand displacement experiments. The inhibit...
In DepthDetails ArticlePubMed