BDBM29106 aminothiazole, 3
SMILES OC(=O)CCNC(=O)c1ccc(CN(c2nc(cs2)-c2ccc(OC(F)(F)F)cc2)c2ccc(cc2)C2=CCCCC2)cc1
InChI Key InChIKey=OUZOYODGROMRMW-UHFFFAOYSA-N
Data  2 IC50
  Tab Delimited (TSV)   2D SDfile   Computed 3D by Vconf -m prep SDfile
Find this compound or compounds like it in BindingDB:
Activity Spreadsheet -- Enzyme Inhibition Constant Data from BindingDB
Found 2 hits for monomerid = 29106
TargetGastric inhibitory polypeptide receptor(Homo sapiens (Human))
Novo Nordisk
LigandPNGBDBM29106(aminothiazole, 3)
Affinity DataIC50:  207nM. Assay description: Wheat Germ Agglutinin derivatized SPA beads containing a scintillant (WGA beads) (Amersham) bound the membranes of BHK cells transfected with the hum...
In DepthDetails ArticlePubMed
TargetGlucagon receptor(Homo sapiens (Human))
Novo Nordisk
LigandPNGBDBM29106(aminothiazole, 3)
Affinity DataIC50:  36nMpH: 7.5 T: 2°C. Assay description: Wheat Germ Agglutinin derivatized SPA beads containing a scintillant (WGA beads) (Amersham) bound the membranes of BHK cells transfected with the hum...
In DepthDetails ArticlePubMed