BDBM29452 Pyrazolo[1,5-a]-1,3,5-triazine, 12-21
SMILES COc1cc(C)c(-c2c(C)nn3c(nc(C)nc23)N(CC=C)CC=C)c(OC)c1
InChI Key InChIKey=GOJIGPCJYHJBBF-UHFFFAOYSA-N
Data  1 IC50
  Tab Delimited (TSV)   2D SDfile   Computed 3D by Vconf -m prep SDfile
Find this compound or compounds like it in BindingDB:
Activity Spreadsheet -- Enzyme Inhibition Constant Data from BindingDB
Found 1 hit for monomerid = 29452
TargetCorticotropin-releasing factor receptor 1(Rattus norvegicus (rat))
Bristol-Myers Squibb
LigandPNGBDBM29452(Pyrazolo[1,5-a]-1,3,5-triazine, 12-21)
Affinity DataIC50:  1nMpH: 7.2 T: 2°C. Assay description: Naive rats were sacrificed by decapitation, and the brain and pituitary were collected. Slide-mounted brain sections were preincubated in an assay so...
In DepthDetails ArticlePubMed