BDBM294714 US10112899, Example 191
SMILES Cc1cc(C)cc(c1)C(=O)N1Cc2c(C1)c(C)c(-c1cc(F)c3OCCCc3c1C)c([C@H](OC(C)(C)C)C(O)=O)c2C
InChI Key InChIKey=RJGMJSHSGPAVRE-YTTGMZPUSA-N
Data  1 IC50
  Tab Delimited (TSV)   2D SDfile   Computed 3D by Vconf -m prep SDfile
Find this compound or compounds like it in BindingDB:
Activity Spreadsheet -- Enzyme Inhibition Constant Data from BindingDB
Found 1 hit for monomerid = 294714
TargetIntegrase(Human immunodeficiency virus 1)
Viiv Healthcare
US Patent
LigandPNGBDBM294714(US10112899, Example 191)
Affinity DataIC50:  2nM. Assay description: Antiviral HIV activity and cytotoxicity values for compounds of the invention from Table 1 were measured in parallel in the HTLV-1 transformed cell l...
Ligand InfoPC cidPC sid
In DepthDetails US Patent