BDBM296127 2-[4-[methyl-[(1S)-1- phenylethyl]amino]phenoxy]pyrido[3,4- d]pyrimidin-4-ol::US10112940, Example 51::US10202381, Example 51::US10208039, Example 51::US10611763, Example 51::US10815234, Example 51::US11535616, Example 51
SMILES C[C@H](N(C)c1ccc(Oc2nc(O)c3ccncc3n2)cc1)c1ccccc1
InChI Key InChIKey=UCLABKYGVIGHCE-HNNXBMFYSA-N
Data  2 IC50
  Tab Delimited (TSV)   2D SDfile   Computed 3D by Vconf -m prep SDfile
Find this compound or compounds like it in BindingDB:
Activity Spreadsheet -- Enzyme Inhibition Constant Data from BindingDB
Found 2 hits for monomerid = 296127
TargetLysine-specific demethylase 4C(Homo sapiens (Human))
Celgene Quanticel Research
US Patent
LigandPNGBDBM296127(2-[4-[methyl-[(1S)-1- phenylethyl]amino]phenoxy]py...)
Affinity DataIC50:  550nM. Assay description: The ability of test compounds to inhibit the activity of JMJD2C was determined in 384-well plate-format under the following reaction conditions: 0.3 ...
Ligand InfoPC cidPC sid
In DepthDetails US Patent
TargetLysine-specific demethylase 4C(Homo sapiens (Human))
Celgene Quanticel Research
US Patent
LigandPNGBDBM296127(2-[4-[methyl-[(1S)-1- phenylethyl]amino]phenoxy]py...)
Affinity DataIC50:  550nMT: 2°C. Assay description: The ability of test compounds to inhibit the activity of JMJD2C was determined in 384-well plate format under the following reaction conditions: 0.3 ...
Ligand InfoPC cidPC sid
In DepthDetails US Patent