BDBM296138 2-[4-[2,3-dihydro-1H-inden-1- ylmethyl(methyl)amino]phenoxy]pyrido [3,4-d]pyrimidin-4-ol::US10112940, Example 62::US10202381, Example 62::US10208039, Example 62::US10611763, Example 62::US10815234, Example 62::US11535616, Example 62
SMILES CN(CC1CCc2ccccc12)c1ccc(Oc2nc(O)c3ccncc3n2)cc1
InChI Key InChIKey=XYLNOUNFHNFTKV-UHFFFAOYSA-N
Data  2 IC50
  Tab Delimited (TSV)   2D SDfile   Computed 3D by Vconf -m prep SDfile
Find this compound or compounds like it in BindingDB:
Activity Spreadsheet -- Enzyme Inhibition Constant Data from BindingDB
Found 2 hits for monomerid = 296138
TargetLysine-specific demethylase 4C(Homo sapiens (Human))
Celgene Quanticel Research
US Patent
LigandPNGBDBM296138(2-[4-[2,3-dihydro-1H-inden-1- ylmethyl(methyl)amin...)
Affinity DataIC50:  550nM. Assay description: The ability of test compounds to inhibit the activity of JMJD2C was determined in 384-well plate-format under the following reaction conditions: 0.3 ...
Ligand InfoPC cidPC sid
In DepthDetails US Patent
TargetLysine-specific demethylase 4C(Homo sapiens (Human))
Celgene Quanticel Research
US Patent
LigandPNGBDBM296138(2-[4-[2,3-dihydro-1H-inden-1- ylmethyl(methyl)amin...)
Affinity DataIC50:  550nMT: 2°C. Assay description: The ability of test compounds to inhibit the activity of JMJD2C was determined in 384-well plate format under the following reaction conditions: 0.3 ...
Ligand InfoPC cidPC sid
In DepthDetails US Patent