BDBM296157 4-[4-(4-hydroxypyrido[3,4-d]pyrimidin-2- yl)oxy-N-methylanilino]benzonitrile::US10112940, Example 81::US10202381, Example 81::US10208039, Example 81::US10611763, Example 81::US10815234, Example 81::US11535616, Example 81
SMILES CN(c1ccc(Oc2nc(O)c3ccncc3n2)cc1)c1ccc(cc1)C#N
InChI Key InChIKey=JJOMOXGDZFYMTA-UHFFFAOYSA-N
Data  2 IC50
  Tab Delimited (TSV)   2D SDfile   Computed 3D by Vconf -m prep SDfile
Find this compound or compounds like it in BindingDB:
Activity Spreadsheet -- Enzyme Inhibition Constant Data from BindingDB
Found 2 hits for monomerid = 296157
TargetLysine-specific demethylase 4C(Homo sapiens (Human))
Celgene Quanticel Research
US Patent
LigandPNGBDBM296157(4-[4-(4-hydroxypyrido[3,4-d]pyrimidin-2- yl)oxy-N-...)
Affinity DataIC50:  550nM. Assay description: The ability of test compounds to inhibit the activity of JMJD2C was determined in 384-well plate-format under the following reaction conditions: 0.3 ...
Ligand InfoPC cidPC sid
In DepthDetails US Patent
TargetLysine-specific demethylase 4C(Homo sapiens (Human))
Celgene Quanticel Research
US Patent
LigandPNGBDBM296157(4-[4-(4-hydroxypyrido[3,4-d]pyrimidin-2- yl)oxy-N-...)
Affinity DataIC50:  550nMT: 2°C. Assay description: The ability of test compounds to inhibit the activity of JMJD2C was determined in 384-well plate format under the following reaction conditions: 0.3 ...
Ligand InfoPC cidPC sid
In DepthDetails US Patent