BDBM296169 2-[4-(4-tert-butyl-N- methylanilino)phenoxy]pyrido[3,4- d]pyrimidin-4-ol::US10112940, Example 92::US10202381, Example 92::US10208039, Example 92::US10611763, Example 92::US10815234, Example 92::US11535616, Example 92
SMILES CN(c1ccc(Oc2nc(O)c3ccncc3n2)cc1)c1ccc(cc1)C(C)(C)C
InChI Key InChIKey=CHULWJUZMOFOBC-UHFFFAOYSA-N
Data  2 IC50
  Tab Delimited (TSV)   2D SDfile   Computed 3D by Vconf -m prep SDfile
Find this compound or compounds like it in BindingDB:
Activity Spreadsheet -- Enzyme Inhibition Constant Data from BindingDB
Found 2 hits for monomerid = 296169
TargetLysine-specific demethylase 4C(Homo sapiens (Human))
Celgene Quanticel Research
US Patent
LigandPNGBDBM296169(2-[4-(4-tert-butyl-N- methylanilino)phenoxy]pyrido...)
Affinity DataIC50:  550nM. Assay description: The ability of test compounds to inhibit the activity of JMJD2C was determined in 384-well plate-format under the following reaction conditions: 0.3 ...
Ligand InfoPC cidPC sid
In DepthDetails US Patent
TargetLysine-specific demethylase 4C(Homo sapiens (Human))
Celgene Quanticel Research
US Patent
LigandPNGBDBM296169(2-[4-(4-tert-butyl-N- methylanilino)phenoxy]pyrido...)
Affinity DataIC50:  550nMT: 2°C. Assay description: The ability of test compounds to inhibit the activity of JMJD2C was determined in 384-well plate format under the following reaction conditions: 0.3 ...
Ligand InfoPC cidPC sid
In DepthDetails US Patent