BDBM298416 4-[[4-[[4-[[5-tert-butyl-3-(methanesulfonamido)-2-methoxy-phenyl]carbamoylamino]-1-naphthyl]oxy]-2-pyridyl]amino]-2-methoxy-N-[(1S)-1-methyl-2-morpholino-ethyl]benzamide::US10125100, Example 17(v)::US10392346, Example 17(v)::US10941115, Example 17(v)::US9751837, Example 17(v)
SMILES COc1cc(Nc2cc(Oc3ccc(NC(=O)Nc4cc(cc(NS(C)(=O)=O)c4OC)C(C)(C)C)c4ccccc34)ccn2)ccc1C(=O)N[C@@H](C)CN1CCOCC1
InChI Key InChIKey=ZORBJIAADRKZOH-MHZLTWQESA-N
Data  4 IC50
  Tab Delimited (TSV)   2D SDfile   Computed 3D by Vconf -m prep SDfile
Find this compound or compounds like it in BindingDB:
Activity Spreadsheet -- Enzyme Inhibition Constant Data from BindingDB
Found 4 hits for monomerid = 298416
TargetBaculoviral IAP repeat-containing protein 2 [174-256](Homo sapiens (Human))
Topivert Pharma
US Patent
LigandPNGBDBM298416(4-[[4-[[4-[[5-tert-butyl-3-(methanesulfonamido)-2-...)
Affinity DataIC50:  116nM. Assay description: p38 MAPKγ: The inhibitory activities of compounds of the invention against p38MAPKγ (MAPK12: Invitrogen), are evaluated in a similar fashio...
Ligand InfoPC cidPC sid
In DepthDetails US Patent
TargetGlycogen synthase kinase-3 alpha(Homo sapiens (Human))
Topivert Pharma
US Patent
LigandPNGBDBM298416(4-[[4-[[4-[[5-tert-butyl-3-(methanesulfonamido)-2-...)
Affinity DataIC50: >1.21E+4nM. Assay description: GSK 3α Method 2: This method follows the same steps as Method 1, but utilises a shorter period of mixing of the test compound (105 minutes inste...
Ligand InfoPC cidPC sid
In DepthDetails US Patent
TargetTyrosine-protein kinase SYK(Homo sapiens (Human))
Topivert Pharma
US Patent
LigandPNGBDBM298416(4-[[4-[[4-[[5-tert-butyl-3-(methanesulfonamido)-2-...)
Affinity DataIC50:  232nM. Assay description: c-Src and Syk: The inhibitory activities of compounds of the invention against c-Src and Syk enzymes (Invitrogen), are evaluated in a similar fashion...
Ligand InfoPC cidPC sid
In DepthDetails US Patent
TargetProto-oncogene tyrosine-protein kinase Src(Homo sapiens (Human))
Topivert Pharma
US Patent
LigandPNGBDBM298416(4-[[4-[[4-[[5-tert-butyl-3-(methanesulfonamido)-2-...)
Affinity DataIC50:  43nM. Assay description: c-Src and Syk: The inhibitory activities of compounds of the invention against c-Src and Syk enzymes (Invitrogen), are evaluated in a similar fashion...
Ligand InfoPC cidPC sid
In DepthDetails US Patent