BDBM298432 4-[[4-[[4-[[5-tert-butyl-3-(methanesulfonamido)-2-methoxy-phenyl]carbamoylamino]-1-naphthyl]oxy]-2-pyridyl]amino]-N-[2-(4,4-difluoro-1-piperidyl)ethyl]-2-methoxy-benzamide::US10125100, Example 17(al)::US10392346, Example 17(al)::US10941115, Example 17(al)::US9751837, Example 17(al)
SMILES COc1cc(Nc2cc(Oc3ccc(NC(=O)Nc4cc(cc(NS(C)(=O)=O)c4OC)C(C)(C)C)c4ccccc34)ccn2)ccc1C(=O)NCCN1CCC(F)(F)CC1
InChI Key InChIKey=UWFBOHBKNSNRKL-UHFFFAOYSA-N
Data  1 IC50
  Tab Delimited (TSV)   2D SDfile   Computed 3D by Vconf -m prep SDfile
Find this compound or compounds like it in BindingDB:
Activity Spreadsheet -- Enzyme Inhibition Constant Data from BindingDB
Found 1 hit for monomerid = 298432
TargetGlycogen synthase kinase-3 alpha(Homo sapiens (Human))
Topivert Pharma
US Patent
LigandPNGBDBM298432(4-[[4-[[4-[[5-tert-butyl-3-(methanesulfonamido)-2-...)
Affinity DataIC50:  1.18E+4nM. Assay description: GSK 3α Method 2: This method follows the same steps as Method 1, but utilises a shorter period of mixing of the test compound (105 minutes inste...
Ligand InfoPC cidPC sid
In DepthDetails US Patent