BDBM298806 US10125118, Example 212::US10947215, Example 212
SMILES CC(N1CCN(CCO)CC1)c1c(F)cc(cc1F)-c1ccc(CO[C@H]2CCC[C@@H]2NC(=O)c2cc(cnc2N)-c2cnn(C)c2)cc1
InChI Key InChIKey=LLEJDHIGLCJFCQ-IPQMPTQSSA-N
Data  2 IC50
  Tab Delimited (TSV)   2D SDfile   Computed 3D by Vconf -m prep SDfile
Find this compound or compounds like it in BindingDB:
Activity Spreadsheet -- Enzyme Inhibition Constant Data from BindingDB
Found 2 hits for monomerid = 298806
TargetTyrosine-protein kinase Mer/receptor UFO(Homo sapiens (Human))
Dong-A Socio Holdings
US Patent
LigandPNGBDBM298806(US10125118, Example 212 | US10947215, Example 212)
Affinity DataIC50: <10nM. Assay description: For the SAR (structure-activity relationship) and compound screening, LanthaScreen™ TR-FRET (Time-Resolved fluorescence energy transfer) assay was em...
Ligand InfoPC cidPC sid
In DepthDetails US Patent
TargetTyrosine-protein kinase Mer(Homo sapiens (Human))
Dong-A Socio Holdings
US Patent
LigandPNGBDBM298806(US10125118, Example 212 | US10947215, Example 212)
Affinity DataIC50: <10nM. Assay description: TBD
Ligand InfoPC cidPC sid
In DepthDetails US Patent