BDBM298819 US10125118, Example 225::US10947215, Example 225
SMILES CN1CCN(CC1)C(C)(C)c1ccc(cc1)-c1ccc(CO[C@H]2CCC[C@@H]2NC(=O)c2cc(cnc2N)-c2ccc(F)nc2)cc1
InChI Key InChIKey=JQDSRUNFNRUWEN-LQJZCPKCSA-N
Data  2 IC50
  Tab Delimited (TSV)   2D SDfile   Computed 3D by Vconf -m prep SDfile
Find this compound or compounds like it in BindingDB:
Activity Spreadsheet -- Enzyme Inhibition Constant Data from BindingDB
Found 2 hits for monomerid = 298819
TargetTyrosine-protein kinase Mer/receptor UFO(Homo sapiens (Human))
Dong-A Socio Holdings
US Patent
LigandPNGBDBM298819(US10125118, Example 225 | US10947215, Example 225)
Affinity DataIC50: <10nM. Assay description: For the SAR (structure-activity relationship) and compound screening, LanthaScreen™ TR-FRET (Time-Resolved fluorescence energy transfer) assay was em...
Ligand InfoPC cidPC sid
In DepthDetails US Patent
TargetTyrosine-protein kinase Mer(Homo sapiens (Human))
Dong-A Socio Holdings
US Patent
LigandPNGBDBM298819(US10125118, Example 225 | US10947215, Example 225)
Affinity DataIC50: <10nM. Assay description: TBD
Ligand InfoPC cidPC sid
In DepthDetails US Patent