BDBM299006 US10125118, Example 412::US10947215, Example 412
SMILES CCc1cc(CO[C@H]2CNC[C@@H]2NC(=O)c2cc(cnc2N)-c2cnn(c2)C2CCNCC2)ccc1C
InChI Key InChIKey=XRBCUXISTGFSAC-UIOOFZCWSA-N
Data  2 IC50
  Tab Delimited (TSV)   2D SDfile   Computed 3D by Vconf -m prep SDfile
Find this compound or compounds like it in BindingDB:
Activity Spreadsheet -- Enzyme Inhibition Constant Data from BindingDB
Found 2 hits for monomerid = 299006
TargetTyrosine-protein kinase Mer/receptor UFO(Homo sapiens (Human))
Dong-A Socio Holdings
US Patent
LigandPNGBDBM299006(US10125118, Example 412 | US10947215, Example 412)
Affinity DataIC50: <10nM. Assay description: For the SAR (structure-activity relationship) and compound screening, LanthaScreen™ TR-FRET (Time-Resolved fluorescence energy transfer) assay was em...
Ligand InfoPC cidPC sid
In DepthDetails US Patent
TargetTyrosine-protein kinase Mer(Homo sapiens (Human))
Dong-A Socio Holdings
US Patent
LigandPNGBDBM299006(US10125118, Example 412 | US10947215, Example 412)
Affinity DataIC50: <10nM. Assay description: TBD
Ligand InfoPC cidPC sid
In DepthDetails US Patent