BDBM299060 N-(5-chloro-3-hydroxypyridin-2-yl)-6-(trifluoromethyl)pyridine-3-sulfonamide::US10125125, Example 41
SMILES Oc1cc(Cl)cnc1NS(=O)(=O)c1ccc(nc1)C(F)(F)F
InChI Key InChIKey=PJSZWNBBUBSERA-UHFFFAOYSA-N
Data  1 IC50
  Tab Delimited (TSV)   2D SDfile   Computed 3D by Vconf -m prep SDfile
Find this compound or compounds like it in BindingDB:
Activity Spreadsheet -- Enzyme Inhibition Constant Data from BindingDB
Found 1 hit for monomerid = 299060
TargetProtein S100-A9(Homo sapiens (Human))
Active Biotech
US Patent
LigandPNGBDBM299060(N-(5-chloro-3-hydroxypyridin-2-yl)-6-(trifluoromet...)
Affinity DataIC50: >1.00E+3nM. Assay description: Incubation of Biot-hS100A9+Compound Samples and rhRAGE-Fc-Acceptor Beads in OptiplateWhen the biot-hS100A9+ compound incubation is finished the solut...
Ligand InfoPC cidPC sid
In DepthDetails US Patent