BDBM299100 1-(3,5-dichlorophenyl)-N-(3-hydroxypyridin-4-yl)methanesulfonamide::US10125125, Example 167
SMILES Oc1cnccc1NS(=O)(=O)Cc1cc(Cl)cc(Cl)c1
InChI Key InChIKey=OKGTXONRYBIZIL-UHFFFAOYSA-N
Data  1 IC50
  Tab Delimited (TSV)   2D SDfile   Computed 3D by Vconf -m prep SDfile
Find this compound or compounds like it in BindingDB:
Activity Spreadsheet -- Enzyme Inhibition Constant Data from BindingDB
Found 1 hit for monomerid = 299100
TargetProtein S100-A9(Homo sapiens (Human))
Active Biotech
US Patent
LigandPNGBDBM299100(1-(3,5-dichlorophenyl)-N-(3-hydroxypyridin-4-yl)me...)
Affinity DataIC50: <1.00E+3nM. Assay description: Incubation of Biot-hS100A9+Compound Samples and rhRAGE-Fc-Acceptor Beads in OptiplateWhen the biot-hS100A9+ compound incubation is finished the solut...
Ligand InfoPC cidPC sid
In DepthDetails US Patent