BDBM300359 US10130619, Example 10
SMILES COc1cc(ccc1O[C@@H](CN1CCCC1)c1ccccc1)C(=O)Nc1nnc(s1)-c1ccncc1
InChI Key InChIKey=VDXFFEFHIZRQMY-DEOSSOPVSA-N
Data  1 KI
  Tab Delimited (TSV)   2D SDfile   Computed 3D by Vconf -m prep SDfile
Find this compound or compounds like it in BindingDB:
Activity Spreadsheet -- Enzyme Inhibition Constant Data from BindingDB
Found 1 hit for monomerid = 300359
TargetNADPH oxidase 1(Homo sapiens (Human))
Genkyotex Suisse
US Patent
LigandPNGBDBM300359(US10130619, Example 10)
Affinity DataKi:  49nM. Assay description: All solutions were placed on ice and protected from light. The final concentration in the 1x hNOX1 membrane fluorescent assay buffer was PBS pH7, 6 &...
Ligand InfoPC cidPC sid
In DepthDetails US Patent