BDBM30665 7-(diethylamino)-4-methyl-3-(4-morpholinylmethyl)-1-benzopyran-2-one::7-(diethylamino)-4-methyl-3-(morpholin-4-ylmethyl)chromen-2-one::7-(diethylamino)-4-methyl-3-(morpholinomethyl)coumarin::7-Diethylamino-4-methyl-3-morpholin-4-ylmethyl-chromen-2-one::MLS000029483::SMR000001241::cid_648121
SMILES CCN(CC)c1ccc2c(C)c(CN3CCOCC3)c(=O)oc2c1
InChI Key InChIKey=SCIHDFZWZMHZKM-UHFFFAOYSA-N
Data  1 EC50
  Tab Delimited (TSV)   2D SDfile   Computed 3D by Vconf -m prep SDfile
Find this compound or compounds like it in BindingDB:
Activity Spreadsheet -- Enzyme Inhibition Constant Data from BindingDB
Found 1 hit for monomerid = 30665
Target5-hydroxytryptamine receptor 1A(Homo sapiens (Human))
The Scripps Research Institute Molecular Screening Center
Curated by PubChem BioAssay
LigandPNGBDBM30665(7-(diethylamino)-4-methyl-3-(4-morpholinylmethyl)-...)
Affinity DataEC50:  4.16E+4nMpH: 7.4 T: 2°C. Assay description: A cell line containing the human 5-HT1a receptor, the promiscuous G-alpha-15 protein (Ga15) as well as the beta-lactamase (BLA) reporter-gene under c...
In DepthDetails PCBioAssay