BDBM30672 (2,2,8-Trimethyl-4H-[1,3]dioxino[4,5-c]pyridin-5-yl)-methanol::(2,2,8-trimethyl-4H-[1,3]dioxino[4,5-c]pyridin-5-yl)methanol::MLS000026774::SMR000011096::cid_70818
SMILES Cc1ncc(CO)c2COC(C)(C)Oc12
InChI Key InChIKey=CZFIJMPIIQHVJD-UHFFFAOYSA-N
Data  1 EC50
  Tab Delimited (TSV)   2D SDfile   Computed 3D by Vconf -m prep SDfile
Find this compound or compounds like it in BindingDB:
Activity Spreadsheet -- Enzyme Inhibition Constant Data from BindingDB
Found 1 hit for monomerid = 30672
Target5-hydroxytryptamine receptor 1A(Homo sapiens (Human))
The Scripps Research Institute Molecular Screening Center
Curated by PubChem BioAssay
LigandPNGBDBM30672((2,2,8-Trimethyl-4H-[1,3]dioxino[4,5-c]pyridin-5-y...)
Affinity DataEC50:  9.90E+4nMpH: 7.4 T: 2°C. Assay description: A cell line containing the human 5-HT1a receptor, the promiscuous G-alpha-15 protein (Ga15) as well as the beta-lactamase (BLA) reporter-gene under c...
In DepthDetails PCBioAssay