BDBM30856 1-(4-methylphenyl)-2,5-bis(oxidanylidene)dipyrido[1,2-d:3',4'-f]pyrimidine-3-carbonitrile::1-(4-methylphenyl)-2,5-dioxo-1,5-dihydro-2H-dipyrido[1,2-a:2',3'-d]pyrimidine-3-carbonitrile::1-(4-methylphenyl)-2,5-dioxo-3-dipyrido[1,2-d:3',4'-f]pyrimidinecarbonitrile::1-(4-methylphenyl)-2,5-dioxodipyrido[1,2-d:3',4'-f]pyrimidine-3-carbonitrile::2,5-diketo-1-(p-tolyl)dipyrido[1,2-d:3',4'-f]pyrimidine-3-carbonitrile::MLS000094257::SMR000029847::cid_3238489
SMILES Cc1ccc(cc1)-n1c2nc3ccccn3c(=O)c2cc(C#N)c1=O
InChI Key InChIKey=GZLZCHMVYKPCEN-UHFFFAOYSA-N
Data  3 EC50
  Tab Delimited (TSV)   2D SDfile   Computed 3D by Vconf -m prep SDfile
Find this compound or compounds like it in BindingDB:
Activity Spreadsheet -- Enzyme Inhibition Constant Data from BindingDB
Found 3 hits for monomerid = 30856
Target5-hydroxytryptamine receptor 1A(Homo sapiens (Human))
The Scripps Research Institute Molecular Screening Center
Curated by PubChem BioAssay
LigandPNGBDBM30856(1-(4-methylphenyl)-2,5-bis(oxidanylidene)dipyrido[...)
Affinity DataEC50:  2.39E+4nMpH: 7.4 T: 2°C. Assay description: A cell line containing the human 5-HT1a receptor, the promiscuous G-alpha-15 protein (Ga15) as well as the beta-lactamase (BLA) reporter-gene under c...
In DepthDetails PCBioAssay
TargetImportin subunit alpha-1(Homo sapiens (Human))
Broad Institute
Curated by PubChem BioAssay
LigandPNGBDBM30856(1-(4-methylphenyl)-2,5-bis(oxidanylidene)dipyrido[...)
Affinity DataEC50:  720nM. Assay description: Keywords: Counterscreen, FRET assay, HTS, YIC probe, Dose response, Assay Overview: This is a fluorescence resonance energy transfer (FRET)-based b...
In DepthDetails PCBioAssay
TargetLysosomal acid glucosylceramidase(Homo sapiens (Human))
The Scripps Research Institute Molecular Screening Center
Curated by PubChem BioAssay
LigandPNGBDBM30856(1-(4-methylphenyl)-2,5-bis(oxidanylidene)dipyrido[...)
Affinity DataEC50: >5.00E+4nM. Assay description: Source (MLSCN Center Name): The Scripps Research Institute Molecular Screening Center Center Affiliation: The Scripps Research Institute, TSRI Assay ...
In DepthDetails PCBioAssay