BDBM309223 (3R,4S)-4-(4-fluorophenyl)-N-[4-fluoro-3-(pyridin-4-yl)phenyl]-1-[(1-methyl-1H-imidazol-4-yl)sulfonyl]pyrrolidin-3-amine::US9656955, Example 746
SMILES Cn1cnc(c1)S(=O)(=O)N1C[C@H](Nc2ccc(F)c(c2)-c2ccncc2)[C@H](C1)c1ccc(F)cc1
InChI Key InChIKey=GJNCAAVDBRCGSW-VWNXMTODSA-N
Data  1 KI
  Tab Delimited (TSV)   2D SDfile   Computed 3D by Vconf -m prep SDfile
Find this compound or compounds like it in BindingDB:
Activity Spreadsheet -- Enzyme Inhibition Constant Data from BindingDB
Found 1 hit for monomerid = 309223
LigandPNGBDBM309223((3R,4S)-4-(4-fluorophenyl)-N-[4-fluoro-3-(pyridin-...)
Affinity DataKi: <10nM. Assay description: Radioligand binding assays using recombinant CHO cell membranes expressing human GlyT1: Radioligand binding to human GlyT1c transporter-expressing me...
Ligand InfoPC cidPC sid
In DepthDetails US Patent