BDBM30945 3-(4-fluorophenyl)-2-[(3-phenyl-1,2,4-oxadiazol-5-yl)methylsulfanyl]quinazolin-4-one::3-(4-fluorophenyl)-2-[(3-phenyl-1,2,4-oxadiazol-5-yl)methylthio]-4-quinazolinone::3-(4-fluorophenyl)-2-[(3-phenyl-1,2,4-oxadiazol-5-yl)methylthio]quinazolin-4-one::MLS000116051::SMR000093038::cid_1520392
SMILES Fc1ccc(cc1)-n1c(SCc2nc(no2)-c2ccccc2)nc2ccccc2c1=O
InChI Key InChIKey=XCYBYLZGQIBDSD-UHFFFAOYSA-N
Data  1 EC50
  Tab Delimited (TSV)   2D SDfile   Computed 3D by Vconf -m prep SDfile
Find this compound or compounds like it in BindingDB:
Activity Spreadsheet -- Enzyme Inhibition Constant Data from BindingDB
Found 1 hit for monomerid = 30945
Target5-hydroxytryptamine receptor 1A(Homo sapiens (Human))
The Scripps Research Institute Molecular Screening Center
Curated by PubChem BioAssay
LigandPNGBDBM30945(3-(4-fluorophenyl)-2-[(3-phenyl-1,2,4-oxadiazol-5-...)
Affinity DataEC50:  9.90E+4nMpH: 7.4 T: 2°C. Assay description: A cell line containing the human 5-HT1a receptor, the promiscuous G-alpha-15 protein (Ga15) as well as the beta-lactamase (BLA) reporter-gene under c...
In DepthDetails PCBioAssay