BDBM31050 6-(3,4-dimethoxyphenyl)-3-propyl-7H-[1,2,4]triazolo[3,4-b][1,3,4]thiadiazine;hydrobromide::MLS000068749::SMR000057783::cid_6603454
SMILES CCCc1nnc2SCC(=Nn12)c1ccc(OC)c(OC)c1
InChI Key InChIKey=MWEBTRAFRKXWQA-UHFFFAOYSA-N
Data  3 IC50
  Tab Delimited (TSV)   2D SDfile   Computed 3D by Vconf -m prep SDfile
Find this compound or compounds like it in BindingDB:
Activity Spreadsheet -- Enzyme Inhibition Constant Data from BindingDB
Found 3 hits for monomerid = 31050
Target5-hydroxytryptamine receptor 1A(Homo sapiens (Human))
The Scripps Research Institute Molecular Screening Center
Curated by PubChem BioAssay
LigandPNGBDBM31050(6-(3,4-dimethoxyphenyl)-3-propyl-7H-[1,2,4]triazol...)
Affinity DataIC50:  4.00E+4nMpH: 7.4 T: 2°C. Assay description: A cell line containing the human 5-HT1a receptor, the promiscuous G-alpha-15 protein (Ga15) as well as the beta-lactamase (BLA) reporter-gene under c...
In DepthDetails PCBioAssay
TargetSphingosine 1-phosphate receptor 3(Homo sapiens (Human))
The Scripps Research Institute Molecular Screening Center
Curated by PubChem BioAssay
LigandPNGBDBM31050(6-(3,4-dimethoxyphenyl)-3-propyl-7H-[1,2,4]triazol...)
Affinity DataIC50: >5.00E+4nM. Assay description: External Assay ID: S1P3_IC50_CS_5H1E_Antagonists Name: S1P3 Dose Response Assay Counterscreen for 5-Hydroxytryptamine(Serotonin) Receptor Subtype 1E ...
In DepthDetails PCBioAssay
Target5-hydroxytryptamine receptor 1E(Homo sapiens (Human))
The Scripps Research Institute Molecular Screening Center
Curated by PubChem BioAssay
LigandPNGBDBM31050(6-(3,4-dimethoxyphenyl)-3-propyl-7H-[1,2,4]triazol...)
Affinity DataIC50:  5.00E+4nMpH: 7.4 T: 2°C. Assay description: To measure 5-HT1E activity, a Chinese Hamster Ovary (CHO) cell line was developed at the Scripps Molecular Research Institute Screening center. This ...
In DepthDetails PCBioAssay