BDBM31157 3-hydroxyquinolin-2(1H)-one, 11
SMILES Cc1cccc2cc(O)c(=O)[nH]c12
InChI Key InChIKey=CZSLHINQRSDCPZ-UHFFFAOYSA-N
Data  2 IC50
  Tab Delimited (TSV)   2D SDfile   Computed 3D by Vconf -m prep SDfile
Find this compound or compounds like it in BindingDB:
Activity Spreadsheet -- Enzyme Inhibition Constant Data from BindingDB
Found 2 hits for monomerid = 31157
TargetD-aspartate oxidase(Homo sapiens (Human))
Pfizer
LigandPNGBDBM31157(3-hydroxyquinolin-2(1H)-one, 11)
Affinity DataIC50:  3.16E+4nM. Assay description: Inhibitory effect of compounds was determined in a cell free fluorescence assay. The H2O2 generated from the degradation of D-aspartic acid was linke...
In DepthDetails ArticlePubMed
TargetD-amino-acid oxidase(Homo sapiens (Human))
Pfizer
LigandPNGBDBM31157(3-hydroxyquinolin-2(1H)-one, 11)
Affinity DataIC50:  38nMpH: 8.5 T: 2°C. Assay description: Inhibitory effect of compounds was determined in a cell free fluorescence assay. The H2O2 generated from the degradation of D-serine was linked to ox...
In DepthDetails ArticlePubMed