BDBM317855 US10399976, Compound 8::US10807980, Compound 8::US11535614, Compound 8::US9624217, Compound 8
SMILES CCS(=O)(=O)c1ccc(CNC(=O)c2cnc3[C@H](C(C)C)N(Cc3c2)c2ncc(cn2)C(F)(F)F)cc1
InChI Key InChIKey=MXZGSNLJYUHJQL-QFIPXVFZSA-N
Data  4 KI  2 IC50
  Tab Delimited (TSV)   2D SDfile   Computed 3D by Vconf -m prep SDfile
Find this compound or compounds like it in BindingDB:
Activity Spreadsheet -- Enzyme Inhibition Constant Data from BindingDB
Found 6 hits for monomerid = 317855
TargetNuclear receptor ROR-gamma(Homo sapiens (Human))
Vitae Pharmaceuticals
US Patent
LigandPNGBDBM317855(US10399976, Compound 8 | US10807980, Compound 8 | ...)
Affinity DataKi: <100nM. Assay description: Compounds of the present invention were tested for ability to bind to RORγ in a cell-free competition assay with commercially available radio-li...
Ligand InfoPC cidPC sid
In DepthDetails US Patent
TargetNuclear receptor ROR-gamma(Homo sapiens (Human))
Vitae Pharmaceuticals
US Patent
LigandPNGBDBM317855(US10399976, Compound 8 | US10807980, Compound 8 | ...)
Affinity DataKi: <100nM. Assay description: Compounds of the present invention were tested for ability to bind to ROR gamma in a cell-free competition assay with commercially available radio-li...
Ligand InfoPC cidPC sid
In DepthDetails US Patent
TargetNuclear receptor ROR-gamma(Homo sapiens (Human))
Vitae Pharmaceuticals
US Patent
LigandPNGBDBM317855(US10399976, Compound 8 | US10807980, Compound 8 | ...)
Affinity DataKi: <100nM. Assay description: Compounds of the present invention were tested for ability to bind to RORγ in a cell-free competition assay with commercially available radio-li...
Ligand InfoPC cidPC sid
In DepthDetails US Patent
TargetNuclear receptor ROR-gamma(Homo sapiens (Human))
Vitae Pharmaceuticals
US Patent
LigandPNGBDBM317855(US10399976, Compound 8 | US10807980, Compound 8 | ...)
Affinity DataKi: <100nM. Assay description: Compounds of the present invention were tested for ability to bind to RORγ in a cell-free competition assay with commercially available radio-li...
Ligand InfoPC cidPC sid
In DepthDetails US Patent
TargetNuclear receptor ROR-gamma(Homo sapiens (Human))
Vitae Pharmaceuticals
US Patent
LigandPNGBDBM317855(US10399976, Compound 8 | US10807980, Compound 8 | ...)
Affinity DataIC50: >1.00E+3nM. Assay description: Compounds of the present invention were tested for RORγ inverse agonist activity in a cell-based, transcriptional activity assay. Secreted Nanol...
Ligand InfoPC cidPC sid
In DepthDetails US Patent
TargetNuclear receptor ROR-gamma(Homo sapiens (Human))
Vitae Pharmaceuticals
US Patent
LigandPNGBDBM317855(US10399976, Compound 8 | US10807980, Compound 8 | ...)
Affinity DataIC50: >1.00E+3nM. Assay description: Compounds of the present invention were tested for ROR gamma inverse agonist activity in a cell-based, transcriptional activity assay. Secreted Nanol...
Ligand InfoPC cidPC sid
In DepthDetails US Patent