BDBM32051 3-chloro-N-(1,1-diketothiolan-3-yl)-N-(2-furfuryl)benzothiophene-2-carboxamide::3-chloro-N-(1,1-dioxo-3-thiolanyl)-N-(2-furanylmethyl)-1-benzothiophene-2-carboxamide::3-chloro-N-(1,1-dioxothiolan-3-yl)-N-(furan-2-ylmethyl)-1-benzothiophene-2-carboxamide::MLS000041094::N-[1,1-bis(oxidanylidene)thiolan-3-yl]-3-chloranyl-N-(furan-2-ylmethyl)-1-benzothiophene-2-carboxamide::SMR000044688::cid_663898
SMILES Clc1c(sc2ccccc12)C(=O)N(Cc1ccco1)C1CCS(=O)(=O)C1
InChI Key InChIKey=RMFYTABJIVXKKF-UHFFFAOYSA-N
Data  1 IC50  1 EC50
  Tab Delimited (TSV)   2D SDfile   Computed 3D by Vconf -m prep SDfile
Find this compound or compounds like it in BindingDB:
Activity Spreadsheet -- Enzyme Inhibition Constant Data from BindingDB
Found 2 hits for monomerid = 32051
TargetDelta-type opioid receptor(Homo sapiens (Human))
The Scripps Research Institute Molecular Screening Center
Curated by PubChem BioAssay
LigandPNGBDBM32051(3-chloro-N-(1,1-diketothiolan-3-yl)-N-(2-furfuryl)...)
Affinity DataEC50:  2.92E+4nM. Assay description: Source (MLPCN Center Name): The Scripps Research Institute Molecular Screening Center (SRIMSC) Affiliation: The Scripps Research Institute, TSRI Assa...
In DepthDetails PCBioAssay
TargetHeat shock protein HSP 90-alpha(Homo sapiens (Human))
Emory University
Curated by PubChem BioAssay
LigandPNGBDBM32051(3-chloro-N-(1,1-diketothiolan-3-yl)-N-(2-furfuryl)...)
Affinity DataIC50:  5.00E+4nMpH: 7.4 T: 2°C. Assay description: A fluorescence polarization based HTS assay has been developed and optimized for the identification of Hsp90 inhibitors by using tumor cell lysate Hs...
In DepthDetails PCBioAssay