BDBM321312 US10179791, Compound 128::US10807991, Compound 128
SMILES OC(=O)CCCN1CCC2(COc3cc(OCc4c(Cl)cccc4Cl)ccc23)CC1
InChI Key InChIKey=FZXZCTPXFSWULS-UHFFFAOYSA-N
Data  9 EC50
  Tab Delimited (TSV)   2D SDfile   Computed 3D by Vconf -m prep SDfile
Find this compound or compounds like it in BindingDB:
Activity Spreadsheet -- Enzyme Inhibition Constant Data from BindingDB
Found 9 hits for monomerid = 321312
TargetSphingosine 1-phosphate receptor 5(Homo sapiens (Human))
Abbvie
US Patent
LigandPNGBDBM321312(US10179791, Compound 128 | US10807991, Compound 12...)
Affinity DataEC50:  25.1nM. Assay description: The CHO-human-S1P5-Aeqorin assay was bought from Euroscreen, Brussels (Euroscreen, Technical dossier, Human Lysophospholid S1P5 (Edg8) receptor, DNA ...
Ligand InfoPC cidPC sid
In DepthDetails US Patent
TargetSphingosine 1-phosphate receptor 1(Homo sapiens (Human))
Abbvie
US Patent
LigandPNGBDBM321312(US10179791, Compound 128 | US10807991, Compound 12...)
Affinity DataEC50: <3.16E+3nM. Assay description: The CHO-K1-Human S1P1-c-AMP assay was performed at Euroscreenfast, Brussels (Euroscreen, Human S1P1 coupling Gi/0, (Edg1) receptor, catalog no: FAST-...
Ligand InfoPC cidPC sid
In DepthDetails US Patent
TargetSphingosine 1-phosphate receptor 3(Homo sapiens (Human))
Abbvie
US Patent
LigandPNGBDBM321312(US10179791, Compound 128 | US10807991, Compound 12...)
Affinity DataEC50: <1.00E+4nM. Assay description: The CHO-human-S1P3-Aeqorin assay (CHO/Gα16/AEQ/h-S1P3) was established at Solvay Pharmaceuticals. The plasmid DNA coding for the S1P3 receptor (...
Ligand InfoPC cidPC sid
In DepthDetails US Patent
TargetSphingosine 1-phosphate receptor 1(Homo sapiens (Human))
Abbvie
US Patent
LigandPNGBDBM321312(US10179791, Compound 128 | US10807991, Compound 12...)
Affinity DataEC50:  5.01E+3nM. Assay description: Agonist activity at human S1P1 receptor expressed in CHO cells assessed as increase in calcium flux by aequorin-derived luminescence assay
Ligand InfoPC cidPC sid
In DepthDetails ArticlePubMed
TargetSphingosine 1-phosphate receptor 3(Homo sapiens (Human))
Abbvie
US Patent
LigandPNGBDBM321312(US10179791, Compound 128 | US10807991, Compound 12...)
Affinity DataEC50: >1.00E+4nM. Assay description: The CHO-human-S1P3-Aeqorin assay (CHO/Gal6/AEQ/h-S1P3) was established at Solvay Pharmaceuticals. The plasmid DNA coding for the S1P3 receptor (acces...
Ligand InfoPC cidPC sid
In DepthDetails US Patent
TargetSphingosine 1-phosphate receptor 3(Homo sapiens (Human))
Abbvie
US Patent
LigandPNGBDBM321312(US10179791, Compound 128 | US10807991, Compound 12...)
Affinity DataEC50:  1.26E+3nM. Assay description: Agonist activity at human S1P3 receptor expressed in CHO cells assessed as increase in calcium flux by aequorin-derived luminescence assay
Ligand InfoPC cidPC sid
In DepthDetails ArticlePubMed
TargetSphingosine 1-phosphate receptor 5(Homo sapiens (Human))
Abbvie
US Patent
LigandPNGBDBM321312(US10179791, Compound 128 | US10807991, Compound 12...)
Affinity DataEC50:  25.1nM. Assay description: The CHO-human-S1P5-Aeqorin assay was bought from Euroscreen, Brussels (Euroscreen, Technical dossier, Human Lysophospholid S1P5 (Edg8) receptor, DNA ...
Ligand InfoPC cidPC sid
In DepthDetails US Patent
TargetSphingosine 1-phosphate receptor 1(Homo sapiens (Human))
Abbvie
US Patent
LigandPNGBDBM321312(US10179791, Compound 128 | US10807991, Compound 12...)
Affinity DataEC50: >3.16E+3nM. Assay description: The CHO-K1-Human S1P1-c-AMP assay was performed at Euroscreenfast, Brussels (Euroscreen, Human S1P1 coupling Gi/0, (Edg1) receptor, catalog n°: FAST-...
Ligand InfoPC cidPC sid
In DepthDetails US Patent
TargetSphingosine 1-phosphate receptor 5(Homo sapiens (Human))
Abbvie
US Patent
LigandPNGBDBM321312(US10179791, Compound 128 | US10807991, Compound 12...)
Affinity DataEC50:  16nM. Assay description: Agonist activity at human S1P5 receptor expressed in CHO cells assessed as increase in calcium flux by aequorin-derived luminescence assay
Ligand InfoPC cidPC sid
In DepthDetails ArticlePubMed