BDBM32140 MLS000111642::SMR000107564::cid_879979
SMILES O=c1oc2c3CCCN4CCCc(cc2s1)c34
InChI Key InChIKey=KGBYKSRNKJGSOO-UHFFFAOYSA-N
Data  4 IC50  2 EC50
  Tab Delimited (TSV)   2D SDfile   Computed 3D by Vconf -m prep SDfile
Find this compound or compounds like it in BindingDB:
Activity Spreadsheet -- Enzyme Inhibition Constant Data from BindingDB
Found 6 hits for monomerid = 32140
TargetHeat shock protein HSP 90-alpha(Homo sapiens (Human))
Emory University
Curated by PubChem BioAssay
LigandPNGBDBM32140(MLS000111642 | SMR000107564 | cid_879979)
Affinity DataIC50:  5.00E+4nMpH: 7.4 T: 2°C. Assay description: A fluorescence polarization based HTS assay has been developed and optimized for the identification of Hsp90 inhibitors by using tumor cell lysate Hs...
In DepthDetails PCBioAssay
TargetNuclear receptor subfamily 4 group A member 1(Homo sapiens (Human))
Burnham Center For Chemical Genomics
Curated by PubChem BioAssay
LigandPNGBDBM32140(MLS000111642 | SMR000107564 | cid_879979)
Affinity DataIC50:  1.04E+4nM. Assay description: Sanford-Burnham Center for Chemical Genomics (SBCCG) Sanford-Burnham Medical Research Institute (San Diego, CA) NIH Molecular Libraries Screening Cen...
In DepthDetails PCBioAssay
TargetPolyadenylate-binding protein 1(Homo sapiens (Human))
Burnham Center For Chemical Genomics
Curated by PubChem BioAssay
LigandPNGBDBM32140(MLS000111642 | SMR000107564 | cid_879979)
Affinity DataIC50: >6.60E+4nM. Assay description: Data Source: Sanford-Burnham Center for Chemical Genomics (SBCCG) Source Affiliation: Sanford-Burnham Medical Research Institute (SBMRI, San Diego, C...
In DepthDetails PCBioAssay
TargetPOsterior Segregation(Caenorhabditis elegans)
Broad Institute
Curated by PubChem BioAssay
LigandPNGBDBM32140(MLS000111642 | SMR000107564 | cid_879979)
Affinity DataEC50:  2.81E+4nM. Assay description: Broad Institute: MLPCN maternal gene expression Project ID: 2024 Keywords: Zinc finger, C. elegans, maternal gene expression, RNA-protein interac...
In DepthDetails PCBioAssay
TargetZinc finger protein mex-5(Caenorhabditis elegans)
Broad Institute
Curated by PubChem BioAssay
LigandPNGBDBM32140(MLS000111642 | SMR000107564 | cid_879979)
Affinity DataEC50:  2.41E+4nM. Assay description: Broad Institute: MLPCN maternal gene expression Project ID: 2024 Keywords: Zinc finger, C. elegans, maternal gene expression, RNA-protein interac...
In DepthDetails PCBioAssay
TargetEstrogen receptor beta(Homo sapiens (Human))
Emory University
Curated by PubChem BioAssay
LigandPNGBDBM32140(MLS000111642 | SMR000107564 | cid_879979)
Affinity DataIC50:  5.00E+4nM. Assay description: NIH Molecular Libraries Screening Centers Network [MLSCN] Emory Chemical Biology Discovery Center in MLSCN Assay provider: John A. Katzenellenbogen, ...
In DepthDetails PCBioAssay