BDBM321443 3-(6-allyl-7-oxo-1H-pyrrolo[2,3-c]pyridin-4-yl)-N,N-dimethyl-benzamide::US10183009, Example 1
SMILES CN(C)C(=O)c1cccc(c1)-c1cn(CC=C)c(=O)c2[nH]ccc12
InChI Key InChIKey=SPSRAFOXVSNAJA-UHFFFAOYSA-N
Data  17 IC50
  Tab Delimited (TSV)   2D SDfile   Computed 3D by Vconf -m prep SDfile
Find this compound or compounds like it in BindingDB:
Activity Spreadsheet -- Enzyme Inhibition Constant Data from BindingDB
Found 17 hits for monomerid = 321443
TargetTranscription initiation factor TFIID subunit 1 [1504-1635](Homo sapiens (Human))
Genentech
US Patent
LigandPNGBDBM321443(3-(6-allyl-7-oxo-1H-pyrrolo[2,3-c]pyridin-4-yl)-N,...)
Affinity DataIC50:  390nM. Assay description: His/Flag epitope tagged CECR2424-538 was cloned, expressed, and purified to homogeneity. CECR2 binding and inhibition was assessed by monitoring the ...
Ligand InfoPC cidPC sid
In DepthDetails US Patent
TargetCREB-binding protein(Homo sapiens (Human))
Genentech
Curated by ChEMBL
LigandPNGBDBM321443(3-(6-allyl-7-oxo-1H-pyrrolo[2,3-c]pyridin-4-yl)-N,...)
Affinity DataIC50: >2.00E+4nM. Assay description: Displacement of biotinylated JQ1 analog from recombinant His-tagged CBP (unknown origin) incubated for 10 mins by TR-FRET assay
Ligand InfoPC cidPC sid
In DepthDetails ArticlePubMed
TargetTranscription initiation factor TFIID subunit 1(Homo sapiens (Human))
Genentech
Curated by ChEMBL
LigandPNGBDBM321443(3-(6-allyl-7-oxo-1H-pyrrolo[2,3-c]pyridin-4-yl)-N,...)
Affinity DataIC50: >2.00E+4nM. Assay description: Inhibition of recombinant His-tagged TAF1 isoform-1 (unknown origin) using biotinylated ligand incubated for 10 mins by TR-FRET assay
Ligand InfoPC cidPC sid
In DepthDetails ArticlePubMed
TargetPeregrin(Homo sapiens (Human))
Genentech
Curated by ChEMBL
LigandPNGBDBM321443(3-(6-allyl-7-oxo-1H-pyrrolo[2,3-c]pyridin-4-yl)-N,...)
Affinity DataIC50: >2.00E+4nM. Assay description: Displacement of biotinylated JQ1 analog from recombinant His-tagged BRPF1 (unknown origin) incubated for 10 mins by TR-FRET assay
Ligand InfoPC cidPC sid
In DepthDetails ArticlePubMed
TargetChromatin remodeling regulator CECR2(Homo sapiens (Human))
Genentech
Curated by ChEMBL
LigandPNGBDBM321443(3-(6-allyl-7-oxo-1H-pyrrolo[2,3-c]pyridin-4-yl)-N,...)
Affinity DataIC50:  170nM. Assay description: Inhibition of recombinant His-tagged CECR2 (unknown origin) using biotinylated ligand incubated for 10 mins by TR-FRET assay
Ligand InfoPC cidPC sid
In DepthDetails ArticlePubMed
TargetBromodomain-containing protein 9(Homo sapiens (Human))
Genentech
Curated by ChEMBL
LigandPNGBDBM321443(3-(6-allyl-7-oxo-1H-pyrrolo[2,3-c]pyridin-4-yl)-N,...)
Affinity DataIC50:  290nM. Assay description: Displacement of biotinylated JQ1 analog from recombinant His-tagged BRD9 (unknown origin) incubated for 10 mins by TR-FRET assay
Ligand InfoPC cidPC sid
In DepthDetails ArticlePubMed
TargetBromodomain-containing protein 4(Homo sapiens (Human))
Genentech
Curated by ChEMBL
LigandPNGBDBM321443(3-(6-allyl-7-oxo-1H-pyrrolo[2,3-c]pyridin-4-yl)-N,...)
Affinity DataIC50:  1.50E+3nM. Assay description: Inhibition of recombinant His-tagged BRD4 bromodomain2 (unknown origin) using biotinylated ligand incubated for 10 mins by TR-FRET assay
Ligand InfoPC cidPC sid
In DepthDetails ArticlePubMed
TargetChromatin remodeling regulator CECR2(Homo sapiens (Human))
Genentech
Curated by ChEMBL
LigandPNGBDBM321443(3-(6-allyl-7-oxo-1H-pyrrolo[2,3-c]pyridin-4-yl)-N,...)
Affinity DataIC50:  170nM. Assay description: Inhibition of recombinant His-tagged CECR2 (unknown origin) using biotinylated ligand incubated for 10 mins by TR-FRET assay
Ligand InfoPC cidPC sid
In DepthDetails ArticlePubMed
TargetBromodomain-containing protein 9(Homo sapiens (Human))
Genentech
Curated by ChEMBL
LigandPNGBDBM321443(3-(6-allyl-7-oxo-1H-pyrrolo[2,3-c]pyridin-4-yl)-N,...)
Affinity DataIC50:  290nM. Assay description: Displacement of biotinylated JQ1 analog from recombinant His-tagged BRD9 (unknown origin) incubated for 10 mins by TR-FRET assay
Ligand InfoPC cidPC sid
In DepthDetails ArticlePubMed
TargetBromodomain-containing protein 4(Homo sapiens (Human))
Genentech
Curated by ChEMBL
LigandPNGBDBM321443(3-(6-allyl-7-oxo-1H-pyrrolo[2,3-c]pyridin-4-yl)-N,...)
Affinity DataIC50:  1.50E+3nM. Assay description: Inhibition of recombinant His-tagged BRD4 bromodomain2 (unknown origin) using biotinylated ligand incubated for 10 mins by TR-FRET assay
Ligand InfoPC cidPC sid
In DepthDetails ArticlePubMed
TargetTranscription initiation factor TFIID subunit 1(Homo sapiens (Human))
Genentech
Curated by ChEMBL
LigandPNGBDBM321443(3-(6-allyl-7-oxo-1H-pyrrolo[2,3-c]pyridin-4-yl)-N,...)
Affinity DataIC50:  770nM. Assay description: Inhibition of recombinant His-tagged TAF1 isoform-2 (unknown origin) using biotinylated ligand incubated for 10 mins by TR-FRET assay
Ligand InfoPC cidPC sid
In DepthDetails ArticlePubMed
TargetTranscription initiation factor TFIID subunit 1(Homo sapiens (Human))
Genentech
Curated by ChEMBL
LigandPNGBDBM321443(3-(6-allyl-7-oxo-1H-pyrrolo[2,3-c]pyridin-4-yl)-N,...)
Affinity DataIC50: >2.00E+4nM. Assay description: Inhibition of recombinant His-tagged TAF1 isoform-1 (unknown origin) using biotinylated ligand incubated for 10 mins by TR-FRET assay
Ligand InfoPC cidPC sid
In DepthDetails ArticlePubMed
TargetPeregrin(Homo sapiens (Human))
Genentech
Curated by ChEMBL
LigandPNGBDBM321443(3-(6-allyl-7-oxo-1H-pyrrolo[2,3-c]pyridin-4-yl)-N,...)
Affinity DataIC50: >2.00E+4nM. Assay description: Displacement of biotinylated JQ1 analog from recombinant His-tagged BRPF1 (unknown origin) incubated for 10 mins by TR-FRET assay
Ligand InfoPC cidPC sid
In DepthDetails ArticlePubMed
TargetCREB-binding protein(Homo sapiens (Human))
Genentech
Curated by ChEMBL
LigandPNGBDBM321443(3-(6-allyl-7-oxo-1H-pyrrolo[2,3-c]pyridin-4-yl)-N,...)
Affinity DataIC50: >2.00E+4nM. Assay description: Displacement of biotinylated JQ1 analog from recombinant His-tagged CBP (unknown origin) incubated for 10 mins by TR-FRET assay
Ligand InfoPC cidPC sid
In DepthDetails ArticlePubMed
TargetBromodomain-containing protein 4(Homo sapiens (Human))
Genentech
Curated by ChEMBL
LigandPNGBDBM321443(3-(6-allyl-7-oxo-1H-pyrrolo[2,3-c]pyridin-4-yl)-N,...)
Affinity DataIC50:  6.30E+3nM. Assay description: Inhibition of recombinant His-tagged BRD4 bromodomain1 (unknown origin) using biotinylated ligand incubated for 10 mins by TR-FRET assay
Ligand InfoPC cidPC sid
In DepthDetails ArticlePubMed
TargetBromodomain-containing protein 4(Homo sapiens (Human))
Genentech
Curated by ChEMBL
LigandPNGBDBM321443(3-(6-allyl-7-oxo-1H-pyrrolo[2,3-c]pyridin-4-yl)-N,...)
Affinity DataIC50:  6.30E+3nM. Assay description: Inhibition of recombinant His-tagged BRD4 bromodomain1 (unknown origin) using biotinylated ligand incubated for 10 mins by TR-FRET assay
Ligand InfoPC cidPC sid
In DepthDetails ArticlePubMed
TargetTranscription initiation factor TFIID subunit 1(Homo sapiens (Human))
Genentech
Curated by ChEMBL
LigandPNGBDBM321443(3-(6-allyl-7-oxo-1H-pyrrolo[2,3-c]pyridin-4-yl)-N,...)
Affinity DataIC50:  770nM. Assay description: Inhibition of recombinant His-tagged TAF1 isoform-2 (unknown origin) using biotinylated ligand incubated for 10 mins by TR-FRET assay
Ligand InfoPC cidPC sid
In DepthDetails ArticlePubMed