BDBM32186 6-[5-(3,4-dimethoxyphenyl)-3-pyrazolidinylidene]-1-cyclohexa-2,4-dienone::6-[5-(3,4-dimethoxyphenyl)pyrazolidin-3-ylidene]cyclohexa-2,4-dien-1-one::TG2-101-3::cid_6807103
SMILES COc1ccc(cc1OC)C1CC(N=N1)c1ccccc1O
InChI Key InChIKey=ISBPSOSFHZEDOT-UHFFFAOYSA-N
Data  2 IC50
  Tab Delimited (TSV)   2D SDfile   Computed 3D by Vconf -m prep SDfile
Find this compound or compounds like it in BindingDB:
Activity Spreadsheet -- Enzyme Inhibition Constant Data from BindingDB
Found 2 hits for monomerid = 32186
TargetHeat shock protein HSP 90-alpha(Homo sapiens (Human))
Emory University
Curated by PubChem BioAssay
LigandPNGBDBM32186(6-[5-(3,4-dimethoxyphenyl)-3-pyrazolidinylidene]-1...)
Affinity DataIC50:  5.23E+4nM. Assay description: Emory Chemistry-Biology Discovery Center Assay Overview: MLSCN Grant: 1 X01MH78953-01 Hsp90 is a chaperon with important roles in maintaining transfo...
In DepthDetails PCBioAssay
TargetHeat shock protein HSP 90-alpha(Homo sapiens (Human))
Emory University
Curated by PubChem BioAssay
LigandPNGBDBM32186(6-[5-(3,4-dimethoxyphenyl)-3-pyrazolidinylidene]-1...)
Affinity DataIC50:  5.00E+4nMpH: 7.4 T: 2°C. Assay description: A fluorescence polarization based HTS assay has been developed and optimized for the identification of Hsp90 inhibitors by using tumor cell lysate Hs...
In DepthDetails PCBioAssay