BDBM32199 5-amino-2-naphthalenol::5-amino-2-naphthol::5-aminonaphthalen-2-ol::5-azanylnaphthalen-2-ol::cid_6865
SMILES Nc1cccc2cc(O)ccc12
InChI Key InChIKey=FSBRKZMSECKELY-UHFFFAOYSA-N
Data  2 IC50
  Tab Delimited (TSV)   2D SDfile   Computed 3D by Vconf -m prep SDfile
Find this compound or compounds like it in BindingDB:
Activity Spreadsheet -- Enzyme Inhibition Constant Data from BindingDB
Found 2 hits for monomerid = 32199
TargetHeat shock protein HSP 90-alpha(Homo sapiens (Human))
Emory University
Curated by PubChem BioAssay
LigandPNGBDBM32199(5-amino-2-naphthalenol | 5-amino-2-naphthol | 5-am...)
Affinity DataIC50: >5.00E+4nM. Assay description: Emory Chemistry-Biology Discovery Center Assay Overview: MLSCN Grant: 1 X01MH78953-01 Hsp90 is a chaperon with important roles in maintaining transfo...
In DepthDetails PCBioAssay
TargetHeat shock protein HSP 90-alpha(Homo sapiens (Human))
Emory University
Curated by PubChem BioAssay
LigandPNGBDBM32199(5-amino-2-naphthalenol | 5-amino-2-naphthol | 5-am...)
Affinity DataIC50:  5.00E+4nMpH: 7.4 T: 2°C. Assay description: A fluorescence polarization based HTS assay has been developed and optimized for the identification of Hsp90 inhibitors by using tumor cell lysate Hs...
In DepthDetails PCBioAssay