BDBM323041 (1R,2R)-N-(4-Oxo-4,5,6,7- tetrahydropyrazolo[1,5-a]pyrazin-3-yl)-2- [4-(1H-pyrazol-5- yl)benzoyl]cyclohexanecarboxamide::US10183947, Example 24::US10508119, Example 24::US11001589, Example 24::US11691978, Example 24
SMILES O=C(Nc1cnn2CCNC(=O)c12)[C@@H]1CCCC[C@H]1C(=O)c1ccc(cc1)-c1ccn[nH]1
InChI Key
Data  1 IC50
  Tab Delimited (TSV)   2D SDfile   Computed 3D by Vconf -m prep SDfile
Find this compound or compounds like it in BindingDB:
Activity Spreadsheet -- Enzyme Inhibition Constant Data from BindingDB
Found 1 hit for monomerid = 323041
TargetArachidonate 5-lipoxygenase-activating protein(Homo sapiens (Human))
Astrazeneca
US Patent
LigandPNGBDBM323041((1R,2R)-N-(4-Oxo-4,5,6,7- tetrahydropyrazolo[1,5-a...)
Affinity DataIC50:  8.10nM. Assay description: Compounds were tested in a competition binding assay using 3H-MK591 as tracer. (Preparation of MK-591 is described in Bioorg. Med. Chem. Lett. 1999, ...
Ligand InfoPC cidPC sid
In DepthDetails US Patent