BDBM32651 dihydro-2H-purin-6-amine, 5
SMILES [#6]\[#6](-[#6])=[#6]/[#6]-n1cnc(-[#7])c2ncnc12
InChI Key InChIKey=BEPGTHDUUROBHM-UHFFFAOYSA-N
Data  1 IC50
PDB links: 1 PDB ID matches this monomer.
  Tab Delimited (TSV)   2D SDfile   Computed 3D by Vconf -m prep SDfile
Find this compound or compounds like it in BindingDB:
Activity Spreadsheet -- Enzyme Inhibition Constant Data from BindingDB
Found 1 hit for monomerid = 32651
TargetBiotin carboxylase(Escherichia coli (strain K12))
Pfizer
LigandPNGBDBM32651(dihydro-2H-purin-6-amine, 5)
Affinity DataIC50:  1.50E+6nMpH: 8.0 T: 2°C. Assay description: Assays were performed in 384-well clear bottom plates (Corning; catalog no. 3702), that contained inhibitor solvated in DMSO. To each well of the pla...