BDBM32663 2,3-Dihydro-benzo[1,4]dioxine-6-sulfonic acid [1-(4-p-tolyl-thiazol-2-yl)-piperidin-4-yl]-amide::MLS000068112::N-[1-[4-(4-methylphenyl)-1,3-thiazol-2-yl]piperidin-4-yl]-2,3-dihydro-1,4-benzodioxine-6-sulfonamide::N-[1-[4-(4-methylphenyl)-2-thiazolyl]-4-piperidinyl]-2,3-dihydro-1,4-benzodioxin-6-sulfonamide::N-[1-[4-(p-tolyl)thiazol-2-yl]-4-piperidyl]-2,3-dihydro-1,4-benzodioxin-6-sulfonamide::SMR000000949::cid_650250
SMILES Cc1ccc(cc1)-c1csc(n1)N1CCC(CC1)NS(=O)(=O)c1ccc2OCCOc2c1
InChI Key InChIKey=IYJMSEMFSSBVGH-UHFFFAOYSA-N
Data  6 IC50  3 EC50
  Tab Delimited (TSV)   2D SDfile   Computed 3D by Vconf -m prep SDfile
Find this compound or compounds like it in BindingDB:
Activity Spreadsheet -- Enzyme Inhibition Constant Data from BindingDB
Found 9 hits for monomerid = 32663
TargetCoagulation factor XI(Homo sapiens (Human))
Pcmd
Curated by PubChem BioAssay
LigandPNGBDBM32663(2,3-Dihydro-benzo[1,4]dioxine-6-sulfonic acid [1-(...)
Affinity DataIC50: >5.00E+4nMpH: 7.4 T: 2°C. Assay description: Factor XIa (0.23 ug/mL) was incubated with Boc-Glu-Ala-Arg-AMC substrate (15 uM) in 10 uL of assay buffer for 2 hr at room temperature. Read fluoresc...
Ligand InfoPC cidPC sid
In DepthDetails PCBioAssay
TargetSphingosine 1-phosphate receptor 1(Homo sapiens (Human))
The Scripps Research Institute Molecular Screening Center
Curated by PubChem BioAssay
LigandPNGBDBM32663(2,3-Dihydro-benzo[1,4]dioxine-6-sulfonic acid [1-(...)
Affinity DataEC50:  5.75E+3nM. Assay description: Source (MLSCN Center Name): The Scripps Research Institute Molecular Screening Center Center Affiliation: The Scripps Research Institute, TSRI Assay ...
Ligand InfoPC cidPC sid
In DepthDetails PCBioAssay
TargetSphingosine 1-phosphate receptor 1(Homo sapiens (Human))
The Scripps Research Institute Molecular Screening Center
Curated by PubChem BioAssay
LigandPNGBDBM32663(2,3-Dihydro-benzo[1,4]dioxine-6-sulfonic acid [1-(...)
Affinity DataEC50:  1.65E+3nM. Assay description: Source (MLSCN Center Name): The Scripps Research Institute Molecular Screening Center Center Affiliation: The Scripps Research Institute, TSRI Assay ...
Ligand InfoPC cidPC sid
In DepthDetails PCBioAssay
TargetSphingosine 1-phosphate receptor 1(Homo sapiens (Human))
The Scripps Research Institute Molecular Screening Center
Curated by PubChem BioAssay
LigandPNGBDBM32663(2,3-Dihydro-benzo[1,4]dioxine-6-sulfonic acid [1-(...)
Affinity DataEC50:  1.40E+3nM. Assay description: Source (MLSCN Center Name): The Scripps Research Institute Molecular Screening Center Center Affiliation: The Scripps Research Institute, TSRI Assay ...
Ligand InfoPC cidPC sid
In DepthDetails PCBioAssay
TargetSteroidogenic factor 1(Homo sapiens (Human))
The Scripps Research Institute Molecular Screening Center
Curated by PubChem BioAssay
LigandPNGBDBM32663(2,3-Dihydro-benzo[1,4]dioxine-6-sulfonic acid [1-(...)
Affinity DataIC50:  1.13E+4nM. Assay description: Source (MLSCN Center Name): The Scripps Research Institute Molecular Screening Center Center Affiliation: The Scripps Research Institute, TSRI Assay ...
Ligand InfoPC cidPC sid
In DepthDetails PCBioAssay
TargetSteroidogenic factor 1(Homo sapiens (Human))
The Scripps Research Institute Molecular Screening Center
Curated by PubChem BioAssay
LigandPNGBDBM32663(2,3-Dihydro-benzo[1,4]dioxine-6-sulfonic acid [1-(...)
Affinity DataIC50:  5.97E+3nM. Assay description: Source (MLSCN Center Name): The Scripps Research Institute Molecular Screening Center Center Affiliation: The Scripps Research Institute, TSRI Assay ...
Ligand InfoPC cidPC sid
In DepthDetails PCBioAssay
TargetIsoform 2 of Nuclear receptor ROR-alpha (Alpha-2)(Homo sapiens (Human))
The Scripps Research Institute Molecular Screening Center
Curated by PubChem BioAssay
LigandPNGBDBM32663(2,3-Dihydro-benzo[1,4]dioxine-6-sulfonic acid [1-(...)
Affinity DataIC50: >3.67E+3nM. Assay description: Source (MLSCN Center Name): The Scripps Research Institute Molecular Screening Center Center Affiliation: The Scripps Research Institute, TSRI Assay ...
Ligand InfoPC cidPC sid
In DepthDetails PCBioAssay
TargetCoagulation factor XI(Homo sapiens (Human))
Pcmd
Curated by PubChem BioAssay
LigandPNGBDBM32663(2,3-Dihydro-benzo[1,4]dioxine-6-sulfonic acid [1-(...)
Affinity DataIC50: >5.00E+4nM. Assay description: Molecular Library Screening Center Network (MLSCN) Penn Center for Molecular Discovery (PCMD) Assay Provider: Scott L. Diamond, University of Pennsy...
Ligand InfoPC cidPC sid
In DepthDetails PCBioAssay
TargetIsoform 2 of Nuclear receptor ROR-alpha (Alpha-2)(Homo sapiens (Human))
The Scripps Research Institute Molecular Screening Center
Curated by PubChem BioAssay
LigandPNGBDBM32663(2,3-Dihydro-benzo[1,4]dioxine-6-sulfonic acid [1-(...)
Affinity DataIC50:  4.42E+3nM. Assay description: Source (MLSCN Center Name): The Scripps Research Institute Molecular Screening Center Center Affiliation: The Scripps Research Institute, TSRI Assay ...
Ligand InfoPC cidPC sid
In DepthDetails PCBioAssay