BDBM32670 2-[2-(2,4-dihydroxy-3-methyl-phenyl)-2-keto-ethyl]isoindoline-1,3-quinone::2-[2-(2,4-dihydroxy-3-methylphenyl)-2-oxoethyl]-1H-isoindole-1,3(2H)-dione::2-[2-(2,4-dihydroxy-3-methylphenyl)-2-oxoethyl]isoindole-1,3-dione::2-[2-[3-methyl-2,4-bis(oxidanyl)phenyl]-2-oxidanylidene-ethyl]isoindole-1,3-dione::MLS000050535::SMR000076484::cid_960579
SMILES Cc1c(O)ccc(C(=O)CN2C(=O)c3ccccc3C2=O)c1O
InChI Key InChIKey=JXHPEVKZXHUCST-UHFFFAOYSA-N
Data  2 IC50
  Tab Delimited (TSV)   2D SDfile   Computed 3D by Vconf -m prep SDfile
Find this compound or compounds like it in BindingDB:
Activity Spreadsheet -- Enzyme Inhibition Constant Data from BindingDB
Found 2 hits for monomerid = 32670
TargetCoagulation factor XI(Homo sapiens (Human))
Pcmd
Curated by PubChem BioAssay
LigandPNGBDBM32670(2-[2-(2,4-dihydroxy-3-methyl-phenyl)-2-keto-ethyl]...)
Affinity DataIC50: >5.00E+4nM. Assay description: Molecular Library Screening Center Network (MLSCN) Penn Center for Molecular Discovery (PCMD) Assay Provider: Scott L. Diamond, University of Pennsy...
In DepthDetails PCBioAssay
TargetCoagulation factor XI(Homo sapiens (Human))
Pcmd
Curated by PubChem BioAssay
LigandPNGBDBM32670(2-[2-(2,4-dihydroxy-3-methyl-phenyl)-2-keto-ethyl]...)
Affinity DataIC50: >5.00E+4nMpH: 7.4 T: 2°C. Assay description: Factor XIa (0.23 ug/mL) was incubated with Boc-Glu-Ala-Arg-AMC substrate (15 uM) in 10 uL of assay buffer for 2 hr at room temperature. Read fluoresc...
In DepthDetails PCBioAssay