BDBM32680 1-benzotriazolyl(1-naphthalenyl)methanone::Benzotriazol-1-yl-naphthalen-1-yl-methanone::MLS000121279::SMR000118701::benzotriazol-1-yl(1-naphthyl)methanone::benzotriazol-1-yl(naphthalen-1-yl)methanone::cid_685693
SMILES O=C(c1cccc2ccccc12)n1nnc2ccccc12
InChI Key InChIKey=SOUJWQBDUNGZJE-UHFFFAOYSA-N
Data  2 IC50
  Tab Delimited (TSV)   2D SDfile   Computed 3D by Vconf -m prep SDfile
Find this compound or compounds like it in BindingDB:
Activity Spreadsheet -- Enzyme Inhibition Constant Data from BindingDB
Found 2 hits for monomerid = 32680
TargetCoagulation factor XI(Homo sapiens (Human))
Pcmd
Curated by PubChem BioAssay
LigandPNGBDBM32680(1-benzotriazolyl(1-naphthalenyl)methanone | Benzot...)
Affinity DataIC50: >5.00E+4nM. Assay description: Molecular Library Screening Center Network (MLSCN) Penn Center for Molecular Discovery (PCMD) Assay Provider: Scott L. Diamond, University of Pennsy...
In DepthDetails PCBioAssay
TargetCoagulation factor XI(Homo sapiens (Human))
Pcmd
Curated by PubChem BioAssay
LigandPNGBDBM32680(1-benzotriazolyl(1-naphthalenyl)methanone | Benzot...)
Affinity DataIC50: >5.00E+4nMpH: 7.4 T: 2°C. Assay description: Factor XIa (0.23 ug/mL) was incubated with Boc-Glu-Ala-Arg-AMC substrate (15 uM) in 10 uL of assay buffer for 2 hr at room temperature. Read fluoresc...
In DepthDetails PCBioAssay