BDBM32712 4-[[2-[1-(4-methylphenyl)-3-(2-methylpropyl)-2,5-dioxo-4-imidazolidinyl]-1-oxoethyl]amino]benzoic acid methyl ester::4-[[2-[3-isobutyl-2,5-diketo-1-(p-tolyl)imidazolidin-4-yl]acetyl]amino]benzoic acid methyl ester::MLS000538939::SMR000144854::cid_2984196::methyl 4-({[3-isobutyl-1-(4-methylphenyl)-2,5-dioxo-4-imidazolidinyl]acetyl}amino)benzoate::methyl 4-[2-[1-(4-methylphenyl)-3-(2-methylpropyl)-2,5-bis(oxidanylidene)imidazolidin-4-yl]ethanoylamino]benzoate::methyl 4-[[2-[1-(4-methylphenyl)-3-(2-methylpropyl)-2,5-dioxoimidazolidin-4-yl]acetyl]amino]benzoate
SMILES COC(=O)c1ccc(NC(=O)Cc2c(O)n(-c3ccc(C)cc3)c(=O)n2CC(C)C)cc1
InChI Key InChIKey=TZAVFDQJRQJMPH-UHFFFAOYSA-N
Data  2 IC50
  Tab Delimited (TSV)   2D SDfile   Computed 3D by Vconf -m prep SDfile
Find this compound or compounds like it in BindingDB:
Activity Spreadsheet -- Enzyme Inhibition Constant Data from BindingDB
Found 2 hits for monomerid = 32712
TargetCoagulation factor XI(Homo sapiens (Human))
Pcmd
Curated by PubChem BioAssay
LigandPNGBDBM32712(4-[[2-[1-(4-methylphenyl)-3-(2-methylpropyl)-2,5-d...)
Affinity DataIC50: >5.00E+4nM. Assay description: Molecular Library Screening Center Network (MLSCN) Penn Center for Molecular Discovery (PCMD) Assay Provider: Scott L. Diamond, University of Pennsy...
Ligand InfoPC cidPC sid
In DepthDetails PCBioAssay
TargetCoagulation factor XI(Homo sapiens (Human))
Pcmd
Curated by PubChem BioAssay
LigandPNGBDBM32712(4-[[2-[1-(4-methylphenyl)-3-(2-methylpropyl)-2,5-d...)
Affinity DataIC50: >5.00E+4nMpH: 7.4 T: 2°C. Assay description: Factor XIa (0.23 ug/mL) was incubated with Boc-Glu-Ala-Arg-AMC substrate (15 uM) in 10 uL of assay buffer for 2 hr at room temperature. Read fluoresc...
Ligand InfoPC cidPC sid
In DepthDetails PCBioAssay